{"text_format":"3","workbook":"xlsx","n_sheets":3,"sheets":["Data Base","Support","DashBoard"],"not_rendered":{"macros":1,"defined_names":3,"pivot_tables":2},"read":"whole","date_system":"1900"}

{"sheet":"Data Base","index":0,"n_rows":167,"n_cols":28,"rows_kept":167}
[]
["Modelo ","Peso ","Tipo de Hoja ","Longitud ","Ancho ","Altura ","Profundidad","Material ","Densidad ","Nivel de empuje","Factor Hoja","Factor de tracción ","Producción por ciclo ","Distancia","dmin","Profundidad de trabajo ","Verificación","Peso de material","Power shift","Carga total","Fuerza de tracción","Velod. Avance","Velod. Retroceso","T. Avance","T. Retroceso","Cm","Eficiencia","Producción Horaria"]
["D7E",{"v":26055,"d":"26055.00"},"Orientación",{"v":6.2,"d":"6.200"},{"v":4.5,"d":"4.500"},1.423,0.715,"Concreto ",{"v":2400,"d":"2400.00"},"Empuje dificultoso",{"$f":"IF(Tabla1[[#This Row],[Nivel de empuje]]=\"Empuje facil\",1.1,IF(Tabla1[[#This Row],[Nivel de empuje]]=\"Empuje promedio\",0.9,IF(Tabla1[[#This Row],[Nivel de empuje]]=\"Empuje medio dificultoso\",0.7,IF(Tabla1[[#This Row],[Nivel de empuje]]=\"Empuje dificultoso\",0.6,\" \"))))","v":{"v":0.6,"d":"0.60"}},0.45,{"$f":"Tabla1[[#This Row],[Ancho ]]*(Tabla1[[#This Row],[Altura ]]^2)*Tabla1[[#This Row],[Factor Hoja]]","v":{"v":5.4673083,"d":"5.467"}},{"$f":"Tabla1[[#This Row],[Producción por ciclo ]]/(Tabla1[[#This Row],[Profundidad]]*Tabla1[[#This Row],[Ancho ]])","v":{"v":1.699241118881119,"d":"1.70"}},{"$f":"MROUND(3*Tabla1[[#This Row],[Longitud ]],10)","v":{"v":20,"d":"20.00"}},{"$f":"Tabla1[[#This Row],[Producción por ciclo ]]/(Tabla1[[#This Row],[dmin]]*Tabla1[[#This Row],[Ancho ]])","v":{"v":0.06074787,"d":"0.0607"}},{"$f":"IF(Tabla1[[#This Row],[Profundidad]]>Tabla1[[#This Row],[Profundidad de trabajo ]],\"Conforme\",\"No conforme\")","v":"Conforme"},{"$f":"Tabla1[[#This Row],[Densidad ]]*Tabla1[[#This Row],[Producción por ciclo ]]","v":{"v":13121.53992,"d":"13121.54"}},{"$f":"2*0.05","v":{"v":0.1,"d":"0.10"}},{"$f":"Tabla1[[#This Row],[Peso ]]+Tabla1[[#This Row],[Peso de material]]","v":{"v":39176.539919999996,"d":"39176.54"}},{"$f":"(Tabla1[[#This Row],[Factor de tracción ]]*Tabla1[[#This Row],[Carga total]])/1000","v":{"v":17.629442964,"d":"17.63"}},{"v":3.1,"d":"3.10"},2.62,{"$f":"Tabla1[[#This Row],[dmin]]/(Tabla1[[#This Row],[Velod. Avance]]*1000/60)","v":{"v":0.38709677419354843,"d":"0.39"}},{"$f":"Tabla1[[#This Row],[dmin]]/(Tabla1[[#This Row],[Velod. Retroceso]]*1000/60)","v":{"v":0.45801526717557256,"d":"0.46"}},{"$f":"Tabla1[[#This Row],[Power shift]]+Tabla1[[#This Row],[T. Avance]]+Tabla1[[#This Row],[T. Retroceso]]","v":{"v":0.945112041369121,"d":"0.95"}},0.69,{"$f":"(Tabla1[[#This Row],[Producción por ciclo ]]*60*Tabla1[[#This Row],[Eficiencia]])/Tabla1[[#This Row],[Cm]]","v":{"v":239.49177844788304,"d":"239.49"}}]
["D7E",{"v":26055,"d":"26055.00"},"Orientación",{"v":6.2,"d":"6.200"},{"v":4.5,"d":"4.500"},1.423,0.715,"Arcilla seca ",{"v":1480,"d":"1480.00"},"Empuje medio dificultoso",{"$f":"IF(Tabla1[[#This Row],[Nivel de empuje]]=\"Empuje facil\",1.1,IF(Tabla1[[#This Row],[Nivel de empuje]]=\"Empuje promedio\",0.9,IF(Tabla1[[#This Row],[Nivel de empuje]]=\"Empuje medio dificultoso\",0.7,IF(Tabla1[[#This Row],[Nivel de empuje]]=\"Empuje dificultoso\",0.6,\" \"))))","v":{"v":0.7,"d":"0.70"}},{"v":0.9,"d":"0.90"},{"$f":"Tabla1[[#This Row],[Ancho ]]*(Tabla1[[#This Row],[Altura ]]^2)*Tabla1[[#This Row],[Factor Hoja]]","v":{"v":6.3785263500000005,"d":"6.379"}},{"$f":"Tabla1[[#This Row],[Producción por ciclo ]]/(Tabla1[[#This Row],[Profundidad]]*Tabla1[[#This Row],[Ancho ]])","v":{"v":1.9824479720279722,"d":"1.98"}},{"$f":"MROUND(3*Tabla1[[#This Row],[Longitud ]],10)","v":{"v":20,"d":"20.00"}},{"$f":"Tabla1[[#This Row],[Producción por ciclo ]]/(Tabla1[[#This Row],[dmin]]*Tabla1[[#This Row],[Ancho ]])","v":{"v":0.07087251500000001,"d":"0.0709"}},{"$f":"IF(Tabla1[[#This Row],[Profundidad]]>Tabla1[[#This Row],[Profundidad de trabajo ]],\"Conforme\",\"No conforme\")","v":"Conforme"},{"$f":"Tabla1[[#This Row],[Densidad ]]*Tabla1[[#This Row],[Producción por ciclo ]]","v":{"v":9440.218998,"d":"9440.22"}},{"v":0.1,"d":"0.10"},{"$f":"Tabla1[[#This Row],[Peso ]]+Tabla1[[#This Row],[Peso de material]]","v":{"v":35495.218998,"d":"35495.22"}},{"$f":"(Tabla1[[#This Row],[Factor de tracción ]]*Tabla1[[#This Row],[Carga total]])/1000","v":{"v":31.9456970982,"d":"31.95"}},{"v":1.3,"d":"1.30"},2.62,{"$f":"Tabla1[[#This Row],[dmin]]/(Tabla1[[#This Row],[Velod. Avance]]*1000/60)","v":{"v":0.923076923076923,"d":"0.92"}},{"$f":"Tabla1[[#This Row],[dmin]]/(Tabla1[[#This Row],[Velod. Retroceso]]*1000/60)","v":{"v":0.45801526717557256,"d":"0.46"}},{"$f":"Tabla1[[#This Row],[Power shift]]+Tabla1[[#This Row],[T. Avance]]+Tabla1[[#This Row],[T. Retroceso]]","v":{"v":1.4810921902524956,"d":"1.48"}},0.69,{"$f":"(Tabla1[[#This Row],[Producción por ciclo ]]*60*Tabla1[[#This Row],[Eficiencia]])/Tabla1[[#This Row],[Cm]]","v":{"v":178.29476964899894,"d":"178.29"}}]
["D7E",{"v":26055,"d":"26055.00"},"Orientación",{"v":6.2,"d":"6.200"},{"v":4.5,"d":"4.500"},1.423,0.715,"Arcilla húmeda",{"v":1660,"d":"1660.00"},"Empuje facil",{"$f":"IF(Tabla1[[#This Row],[Nivel de empuje]]=\"Empuje facil\",1.1,IF(Tabla1[[#This Row],[Nivel de empuje]]=\"Empuje promedio\",0.9,IF(Tabla1[[#This Row],[Nivel de empuje]]=\"Empuje medio dificultoso\",0.7,IF(Tabla1[[#This Row],[Nivel de empuje]]=\"Empuje dificultoso\",0.6,\" \"))))","v":{"v":1.1,"d":"1.10"}},{"v":0.7,"d":"0.70"},{"$f":"Tabla1[[#This Row],[Ancho ]]*(Tabla1[[#This Row],[Altura ]]^2)*Tabla1[[#This Row],[Factor Hoja]]","v":{"v":10.023398550000001,"d":"10.023"}},{"$f":"Tabla1[[#This Row],[Producción por ciclo ]]/(Tabla1[[#This Row],[Profundidad]]*Tabla1[[#This Row],[Ancho ]])","v":{"v":3.1152753846153853,"d":"3.12"}},{"$f":"MROUND(3*Tabla1[[#This Row],[Longitud ]],10)","v":{"v":20,"d":"20.00"}},{"$f":"Tabla1[[#This Row],[Producción por ciclo ]]/(Tabla1[[#This Row],[dmin]]*Tabla1[[#This Row],[Ancho ]])","v":{"v":0.11137109500000002,"d":"0.1114"}},{"$f":"IF(Tabla1[[#This Row],[Profundidad]]>Tabla1[[#This Row],[Profundidad de trabajo ]],\"Conforme\",\"No conforme\")","v":"Conforme"},{"$f":"Tabla1[[#This Row],[Densidad ]]*Tabla1[[#This Row],[Producción por ciclo ]]","v":{"v":16638.841593,"d":"16638.84"}},{"v":0.1,"d":"0.10"},{"$f":"Tabla1[[#This Row],[Peso ]]+Tabla1[[#This Row],[Peso de material]]","v":{"v":42693.841593000005,"d":"42693.84"}},{"$f":"(Tabla1[[#This Row],[Factor de tracción ]]*Tabla1[[#This Row],[Carga total]])/1000","v":{"v":29.885689115100003,"d":"29.89"}},{"v":1.5,"d":"1.50"},2.62,{"$f":"Tabla1[[#This Row],[dmin]]/(Tabla1[[#This Row],[Velod. Avance]]*1000/60)","v":{"v":0.8,"d":"0.80"}},{"$f":"Tabla1[[#This Row],[dmin]]/(Tabla1[[#This Row],[Velod. Retroceso]]*1000/60)","v":{"v":0.45801526717557256,"d":"0.46"}},{"$f":"Tabla1[[#This Row],[Power shift]]+Tabla1[[#This Row],[T. Avance]]+Tabla1[[#This Row],[T. Retroceso]]","v":{"v":1.3580152671755725,"d":"1.36"}},0.69,{"$f":"(Tabla1[[#This Row],[Producción por ciclo ]]*60*Tabla1[[#This Row],[Eficiencia]])/Tabla1[[#This Row],[Cm]]","v":{"v":305.5699814281619,"d":"305.57"}}]
["D7E",{"v":26055,"d":"26055.00"},"Orientación",{"v":6.2,"d":"6.200"},{"v":4.5,"d":"4.500"},1.423,0.715,"Arena seca ",{"v":1420,"d":"1420.00"},"Empuje facil",{"$f":"IF(Tabla1[[#This Row],[Nivel de empuje]]=\"Empuje facil\",1.1,IF(Tabla1[[#This Row],[Nivel de empuje]]=\"Empuje promedio\",0.9,IF(Tabla1[[#This Row],[Nivel de empuje]]=\"Empuje medio dificultoso\",0.7,IF(Tabla1[[#This Row],[Nivel de empuje]]=\"Empuje dificultoso\",0.6,\" \"))))","v":{"v":1.1,"d":"1.10"}},0.39,{"$f":"Tabla1[[#This Row],[Ancho ]]*(Tabla1[[#This Row],[Altura ]]^2)*Tabla1[[#This Row],[Factor Hoja]]","v":{"v":10.023398550000001,"d":"10.023"}},{"$f":"Tabla1[[#This Row],[Producción por ciclo ]]/(Tabla1[[#This Row],[Profundidad]]*Tabla1[[#This Row],[Ancho ]])","v":{"v":3.1152753846153853,"d":"3.12"}},{"$f":"MROUND(3*Tabla1[[#This Row],[Longitud ]],10)","v":{"v":20,"d":"20.00"}},{"$f":"Tabla1[[#This Row],[Producción por ciclo ]]/(Tabla1[[#This Row],[dmin]]*Tabla1[[#This Row],[Ancho ]])","v":{"v":0.11137109500000002,"d":"0.1114"}},{"$f":"IF(Tabla1[[#This Row],[Profundidad]]>Tabla1[[#This Row],[Profundidad de trabajo ]],\"Conforme\",\"No conforme\")","v":"Conforme"},{"$f":"Tabla1[[#This Row],[Densidad ]]*Tabla1[[#This Row],[Producción por ciclo ]]","v":{"v":14233.225941000002,"d":"14233.23"}},{"v":0.1,"d":"0.10"},{"$f":"Tabla1[[#This Row],[Peso ]]+Tabla1[[#This Row],[Peso de material]]","v":{"v":40288.225941000004,"d":"40288.23"}},{"$f":"(Tabla1[[#This Row],[Factor de tracción ]]*Tabla1[[#This Row],[Carga total]])/1000","v":{"v":15.712408116990002,"d":"15.71"}},{"v":3.2,"d":"3.20"},2.62,{"$f":"Tabla1[[#This Row],[dmin]]/(Tabla1[[#This Row],[Velod. Avance]]*1000/60)","v":{"v":0.375,"d":"0.38"}},{"$f":"Tabla1[[#This Row],[dmin]]/(Tabla1[[#This Row],[Velod. Retroceso]]*1000/60)","v":{"v":0.45801526717557256,"d":"0.46"}},{"$f":"Tabla1[[#This Row],[Power shift]]+Tabla1[[#This Row],[T. Avance]]+Tabla1[[#This Row],[T. Retroceso]]","v":{"v":0.9330152671755725,"d":"0.93"}},0.69,{"$f":"(Tabla1[[#This Row],[Producción por ciclo ]]*60*Tabla1[[#This Row],[Eficiencia]])/Tabla1[[#This Row],[Cm]]","v":{"v":444.76088931127026,"d":"444.76"}}]
["D7E",{"v":26055,"d":"26055.00"},"Orientación",{"v":6.2,"d":"6.200"},{"v":4.5,"d":"4.500"},1.423,0.715,"Arena húmeda ",{"v":1690,"d":"1690.00"},"Empuje medio dificultoso",{"$f":"IF(Tabla1[[#This Row],[Nivel de empuje]]=\"Empuje facil\",1.1,IF(Tabla1[[#This Row],[Nivel de empuje]]=\"Empuje promedio\",0.9,IF(Tabla1[[#This Row],[Nivel de empuje]]=\"Empuje medio dificultoso\",0.7,IF(Tabla1[[#This Row],[Nivel de empuje]]=\"Empuje dificultoso\",0.6,\" \"))))","v":{"v":0.7,"d":"0.70"}},{"v":0.5,"d":"0.50"},{"$f":"Tabla1[[#This Row],[Ancho ]]*(Tabla1[[#This Row],[Altura ]]^2)*Tabla1[[#This Row],[Factor Hoja]]","v":{"v":6.3785263500000005,"d":"6.379"}},{"$f":"Tabla1[[#This Row],[Producción por ciclo ]]/(Tabla1[[#This Row],[Profundidad]]*Tabla1[[#This Row],[Ancho ]])","v":{"v":1.9824479720279722,"d":"1.98"}},{"$f":"MROUND(3*Tabla1[[#This Row],[Longitud ]],10)","v":{"v":20,"d":"20.00"}},{"$f":"Tabla1[[#This Row],[Producción por ciclo ]]/(Tabla1[[#This Row],[dmin]]*Tabla1[[#This Row],[Ancho ]])","v":{"v":0.07087251500000001,"d":"0.0709"}},{"$f":"IF(Tabla1[[#This Row],[Profundidad]]>Tabla1[[#This Row],[Profundidad de trabajo ]],\"Conforme\",\"No conforme\")","v":"Conforme"},{"$f":"Tabla1[[#This Row],[Densidad ]]*Tabla1[[#This Row],[Producción por ciclo ]]","v":{"v":10779.7095315,"d":"10779.71"}},{"v":0.1,"d":"0.10"},{"$f":"Tabla1[[#This Row],[Peso ]]+Tabla1[[#This Row],[Peso de material]]","v":{"v":36834.709531500004,"d":"36834.71"}},{"$f":"(Tabla1[[#This Row],[Factor de tracción ]]*Tabla1[[#This Row],[Carga total]])/1000","v":{"v":18.41735476575,"d":"18.42"}},{"v":2.7,"d":"2.70"},2.62,{"$f":"Tabla1[[#This Row],[dmin]]/(Tabla1[[#This Row],[Velod. Avance]]*1000/60)","v":{"v":0.4444444444444444,"d":"0.44"}},{"$f":"Tabla1[[#This Row],[dmin]]/(Tabla1[[#This Row],[Velod. Retroceso]]*1000/60)","v":{"v":0.45801526717557256,"d":"0.46"}},{"$f":"Tabla1[[#This Row],[Power shift]]+Tabla1[[#This Row],[T. Avance]]+Tabla1[[#This Row],[T. Retroceso]]","v":{"v":1.002459711620017,"d":"1.00"}},0.69,{"$f":"(Tabla1[[#This Row],[Producción por ciclo ]]*60*Tabla1[[#This Row],[Eficiencia]])/Tabla1[[#This Row],[Cm]]","v":{"v":263.4230461623742,"d":"263.42"}}]
["D7E",{"v":26055,"d":"26055.00"},"Orientación",{"v":6.2,"d":"6.200"},{"v":4.5,"d":"4.500"},1.423,0.715,"Grava suelta ",{"v":1930,"d":"1930.00"},"Empuje promedio",{"$f":"IF(Tabla1[[#This Row],[Nivel de empuje]]=\"Empuje facil\",1.1,IF(Tabla1[[#This Row],[Nivel de empuje]]=\"Empuje promedio\",0.9,IF(Tabla1[[#This Row],[Nivel de empuje]]=\"Empuje medio dificultoso\",0.7,IF(Tabla1[[#This Row],[Nivel de empuje]]=\"Empuje dificultoso\",0.6,\" \"))))","v":{"v":0.9,"d":"0.90"}},{"v":0.5,"d":"0.50"},{"$f":"Tabla1[[#This Row],[Ancho ]]*(Tabla1[[#This Row],[Altura ]]^2)*Tabla1[[#This Row],[Factor Hoja]]","v":{"v":8.20096245,"d":"8.201"}},{"$f":"Tabla1[[#This Row],[Producción por ciclo ]]/(Tabla1[[#This Row],[Profundidad]]*Tabla1[[#This Row],[Ancho ]])","v":{"v":2.5488616783216784,"d":"2.55"}},{"$f":"MROUND(3*Tabla1[[#This Row],[Longitud ]],10)","v":{"v":20,"d":"20.00"}},{"$f":"Tabla1[[#This Row],[Producción por ciclo ]]/(Tabla1[[#This Row],[dmin]]*Tabla1[[#This Row],[Ancho ]])","v":{"v":0.091121805,"d":"0.0911"}},{"$f":"IF(Tabla1[[#This Row],[Profundidad]]>Tabla1[[#This Row],[Profundidad de trabajo ]],\"Conforme\",\"No conforme\")","v":"Conforme"},{"$f":"Tabla1[[#This Row],[Densidad ]]*Tabla1[[#This Row],[Producción por ciclo ]]","v":{"v":15827.8575285,"d":"15827.86"}},{"v":0.1,"d":"0.10"},{"$f":"Tabla1[[#This Row],[Peso ]]+Tabla1[[#This Row],[Peso de material]]","v":{"v":41882.8575285,"d":"41882.86"}},{"$f":"(Tabla1[[#This Row],[Factor de tracción ]]*Tabla1[[#This Row],[Carga total]])/1000","v":{"v":20.94142876425,"d":"20.94"}},{"v":2.3,"d":"2.30"},2.62,{"$f":"Tabla1[[#This Row],[dmin]]/(Tabla1[[#This Row],[Velod. Avance]]*1000/60)","v":{"v":0.5217391304347826,"d":"0.52"}},{"$f":"Tabla1[[#This Row],[dmin]]/(Tabla1[[#This Row],[Velod. Retroceso]]*1000/60)","v":{"v":0.45801526717557256,"d":"0.46"}},{"$f":"Tabla1[[#This Row],[Power shift]]+Tabla1[[#This Row],[T. Avance]]+Tabla1[[#This Row],[T. Retroceso]]","v":{"v":1.0797543976103552,"d":"1.08"}},0.69,{"$f":"(Tabla1[[#This Row],[Producción por ciclo ]]*60*Tabla1[[#This Row],[Eficiencia]])/Tabla1[[#This Row],[Cm]]","v":{"v":314.44173432532807,"d":"314.44"}}]
["D7E",{"v":26055,"d":"26055.00"},"Orientación",{"v":6.2,"d":"6.200"},{"v":4.5,"d":"4.500"},1.423,0.715,"Nieve compacta",{"v":130,"d":"130.00"},"Empuje medio dificultoso",{"$f":"IF(Tabla1[[#This Row],[Nivel de empuje]]=\"Empuje facil\",1.1,IF(Tabla1[[#This Row],[Nivel de empuje]]=\"Empuje promedio\",0.9,IF(Tabla1[[#This Row],[Nivel de empuje]]=\"Empuje medio dificultoso\",0.7,IF(Tabla1[[#This Row],[Nivel de empuje]]=\"Empuje dificultoso\",0.6,\" \"))))","v":{"v":0.7,"d":"0.70"}},0.27,{"$f":"Tabla1[[#This Row],[Ancho ]]*(Tabla1[[#This Row],[Altura ]]^2)*Tabla1[[#This Row],[Factor Hoja]]","v":{"v":6.3785263500000005,"d":"6.379"}},{"$f":"Tabla1[[#This Row],[Producción por ciclo ]]/(Tabla1[[#This Row],[Profundidad]]*Tabla1[[#This Row],[Ancho ]])","v":{"v":1.9824479720279722,"d":"1.98"}},{"$f":"MROUND(3*Tabla1[[#This Row],[Longitud ]],10)","v":{"v":20,"d":"20.00"}},{"$f":"Tabla1[[#This Row],[Producción por ciclo ]]/(Tabla1[[#This Row],[dmin]]*Tabla1[[#This Row],[Ancho ]])","v":{"v":0.07087251500000001,"d":"0.0709"}},{"$f":"IF(Tabla1[[#This Row],[Profundidad]]>Tabla1[[#This Row],[Profundidad de trabajo ]],\"Conforme\",\"No conforme\")","v":"Conforme"},{"$f":"Tabla1[[#This Row],[Densidad ]]*Tabla1[[#This Row],[Producción por ciclo ]]","v":{"v":829.2084255000001,"d":"829.21"}},{"v":0.1,"d":"0.10"},{"$f":"Tabla1[[#This Row],[Peso ]]+Tabla1[[#This Row],[Peso de material]]","v":{"v":26884.2084255,"d":"26884.21"}},{"$f":"(Tabla1[[#This Row],[Factor de tracción ]]*Tabla1[[#This Row],[Carga total]])/1000","v":{"v":7.258736274885001,"d":"7.26"}},{"v":7,"d":"7.00"},2.62,{"$f":"Tabla1[[#This Row],[dmin]]/(Tabla1[[#This Row],[Velod. Avance]]*1000/60)","v":{"v":0.17142857142857143,"d":"0.17"}},{"$f":"Tabla1[[#This Row],[dmin]]/(Tabla1[[#This Row],[Velod. Retroceso]]*1000/60)","v":{"v":0.45801526717557256,"d":"0.46"}},{"$f":"Tabla1[[#This Row],[Power shift]]+Tabla1[[#This Row],[T. Avance]]+Tabla1[[#This Row],[T. Retroceso]]","v":{"v":0.729443838604144,"d":"0.73"}},0.69,{"$f":"(Tabla1[[#This Row],[Producción por ciclo ]]*60*Tabla1[[#This Row],[Eficiencia]])/Tabla1[[#This Row],[Cm]]","v":{"v":362.01689138306176,"d":"362.02"}}]
["D7E",{"v":26055,"d":"26055.00"},"Orientación",{"v":6.2,"d":"6.200"},{"v":4.5,"d":"4.500"},1.423,0.715,"Hielo ",{"v":520,"d":"520.00"},"Empuje dificultoso",{"$f":"IF(Tabla1[[#This Row],[Nivel de empuje]]=\"Empuje facil\",1.1,IF(Tabla1[[#This Row],[Nivel de empuje]]=\"Empuje promedio\",0.9,IF(Tabla1[[#This Row],[Nivel de empuje]]=\"Empuje medio dificultoso\",0.7,IF(Tabla1[[#This Row],[Nivel de empuje]]=\"Empuje dificultoso\",0.6,\" \"))))","v":{"v":0.6,"d":"0.60"}},0.12,{"$f":"Tabla1[[#This Row],[Ancho ]]*(Tabla1[[#This Row],[Altura ]]^2)*Tabla1[[#This Row],[Factor Hoja]]","v":{"v":5.4673083,"d":"5.467"}},{"$f":"Tabla1[[#This Row],[Producción por ciclo ]]/(Tabla1[[#This Row],[Profundidad]]*Tabla1[[#This Row],[Ancho ]])","v":{"v":1.699241118881119,"d":"1.70"}},{"$f":"MROUND(3*Tabla1[[#This Row],[Longitud ]],10)","v":{"v":20,"d":"20.00"}},{"$f":"Tabla1[[#This Row],[Producción por ciclo ]]/(Tabla1[[#This Row],[dmin]]*Tabla1[[#This Row],[Ancho ]])","v":{"v":0.06074787,"d":"0.0607"}},{"$f":"IF(Tabla1[[#This Row],[Profundidad]]>Tabla1[[#This Row],[Profundidad de trabajo ]],\"Conforme\",\"No conforme\")","v":"Conforme"},{"$f":"Tabla1[[#This Row],[Densidad ]]*Tabla1[[#This Row],[Producción por ciclo ]]","v":{"v":2843.000316,"d":"2843.00"}},{"v":0.1,"d":"0.10"},{"$f":"Tabla1[[#This Row],[Peso ]]+Tabla1[[#This Row],[Peso de material]]","v":{"v":28898.000316,"d":"28898.00"}},{"$f":"(Tabla1[[#This Row],[Factor de tracción ]]*Tabla1[[#This Row],[Carga total]])/1000","v":{"v":3.4677600379199998,"d":"3.47"}},{"v":11,"d":"11.00"},2.62,{"$f":"Tabla1[[#This Row],[dmin]]/(Tabla1[[#This Row],[Velod. Avance]]*1000/60)","v":{"v":0.10909090909090909,"d":"0.11"}},{"$f":"Tabla1[[#This Row],[dmin]]/(Tabla1[[#This Row],[Velod. Retroceso]]*1000/60)","v":{"v":0.45801526717557256,"d":"0.46"}},{"$f":"Tabla1[[#This Row],[Power shift]]+Tabla1[[#This Row],[T. Avance]]+Tabla1[[#This Row],[T. Retroceso]]","v":{"v":0.6671061762664816,"d":"0.67"}},0.69,{"$f":"(Tabla1[[#This Row],[Producción por ciclo ]]*60*Tabla1[[#This Row],[Eficiencia]])/Tabla1[[#This Row],[Cm]]","v":{"v":339.29615955104543,"d":"339.30"}}]
["D7E",{"v":26055,"d":"26055.00"},"Orientación",{"v":6.2,"d":"6.200"},{"v":4.5,"d":"4.500"},1.423,0.715,"Tierra firme ",{"v":1510,"d":"1510.00"},"Empuje facil",{"$f":"IF(Tabla1[[#This Row],[Nivel de empuje]]=\"Empuje facil\",1.1,IF(Tabla1[[#This Row],[Nivel de empuje]]=\"Empuje promedio\",0.9,IF(Tabla1[[#This Row],[Nivel de empuje]]=\"Empuje medio dificultoso\",0.7,IF(Tabla1[[#This Row],[Nivel de empuje]]=\"Empuje dificultoso\",0.6,\" \"))))","v":{"v":1.1,"d":"1.10"}},{"v":0.9,"d":"0.90"},{"$f":"Tabla1[[#This Row],[Ancho ]]*(Tabla1[[#This Row],[Altura ]]^2)*Tabla1[[#This Row],[Factor Hoja]]","v":{"v":10.023398550000001,"d":"10.023"}},{"$f":"Tabla1[[#This Row],[Producción por ciclo ]]/(Tabla1[[#This Row],[Profundidad]]*Tabla1[[#This Row],[Ancho ]])","v":{"v":3.1152753846153853,"d":"3.12"}},{"$f":"MROUND(3*Tabla1[[#This Row],[Longitud ]],10)","v":{"v":20,"d":"20.00"}},{"$f":"Tabla1[[#This Row],[Producción por ciclo ]]/(Tabla1[[#This Row],[dmin]]*Tabla1[[#This Row],[Ancho ]])","v":{"v":0.11137109500000002,"d":"0.1114"}},{"$f":"IF(Tabla1[[#This Row],[Profundidad]]>Tabla1[[#This Row],[Profundidad de trabajo ]],\"Conforme\",\"No conforme\")","v":"Conforme"},{"$f":"Tabla1[[#This Row],[Densidad ]]*Tabla1[[#This Row],[Producción por ciclo ]]","v":{"v":15135.331810500002,"d":"15135.33"}},{"v":0.1,"d":"0.10"},{"$f":"Tabla1[[#This Row],[Peso ]]+Tabla1[[#This Row],[Peso de material]]","v":{"v":41190.3318105,"d":"41190.33"}},{"$f":"(Tabla1[[#This Row],[Factor de tracción ]]*Tabla1[[#This Row],[Carga total]])/1000","v":{"v":37.07129862945,"d":"37.07"}},{"v":0.9,"d":"0.90"},2.62,{"$f":"Tabla1[[#This Row],[dmin]]/(Tabla1[[#This Row],[Velod. Avance]]*1000/60)","v":{"v":1.3333333333333333,"d":"1.33"}},{"$f":"Tabla1[[#This Row],[dmin]]/(Tabla1[[#This Row],[Velod. Retroceso]]*1000/60)","v":{"v":0.45801526717557256,"d":"0.46"}},{"$f":"Tabla1[[#This Row],[Power shift]]+Tabla1[[#This Row],[T. Avance]]+Tabla1[[#This Row],[T. Retroceso]]","v":{"v":1.891348600508906,"d":"1.89"}},0.69,{"$f":"(Tabla1[[#This Row],[Producción por ciclo ]]*60*Tabla1[[#This Row],[Eficiencia]])/Tabla1[[#This Row],[Cm]]","v":{"v":219.40360431617114,"d":"219.40"}}]
["D7E",{"v":26055,"d":"26055.00"},"Orientación",{"v":6.2,"d":"6.200"},{"v":4.5,"d":"4.500"},1.423,0.715,"Tierra suelta ",{"v":1250,"d":"1250.00"},"Empuje facil",{"$f":"IF(Tabla1[[#This Row],[Nivel de empuje]]=\"Empuje facil\",1.1,IF(Tabla1[[#This Row],[Nivel de empuje]]=\"Empuje promedio\",0.9,IF(Tabla1[[#This Row],[Nivel de empuje]]=\"Empuje medio dificultoso\",0.7,IF(Tabla1[[#This Row],[Nivel de empuje]]=\"Empuje dificultoso\",0.6,\" \"))))","v":{"v":1.1,"d":"1.10"}},{"v":0.6,"d":"0.60"},{"$f":"Tabla1[[#This Row],[Ancho ]]*(Tabla1[[#This Row],[Altura ]]^2)*Tabla1[[#This Row],[Factor Hoja]]","v":{"v":10.023398550000001,"d":"10.023"}},{"$f":"Tabla1[[#This Row],[Producción por ciclo ]]/(Tabla1[[#This Row],[Profundidad]]*Tabla1[[#This Row],[Ancho ]])","v":{"v":3.1152753846153853,"d":"3.12"}},{"$f":"MROUND(3*Tabla1[[#This Row],[Longitud ]],10)","v":{"v":20,"d":"20.00"}},{"$f":"Tabla1[[#This Row],[Producción por ciclo ]]/(Tabla1[[#This Row],[dmin]]*Tabla1[[#This Row],[Ancho ]])","v":{"v":0.11137109500000002,"d":"0.1114"}},{"$f":"IF(Tabla1[[#This Row],[Profundidad]]>Tabla1[[#This Row],[Profundidad de trabajo ]],\"Conforme\",\"No conforme\")","v":"Conforme"},{"$f":"Tabla1[[#This Row],[Densidad ]]*Tabla1[[#This Row],[Producción por ciclo ]]","v":{"v":12529.248187500001,"d":"12529.25"}},{"v":0.1,"d":"0.10"},{"$f":"Tabla1[[#This Row],[Peso ]]+Tabla1[[#This Row],[Peso de material]]","v":{"v":38584.2481875,"d":"38584.25"}},{"$f":"(Tabla1[[#This Row],[Factor de tracción ]]*Tabla1[[#This Row],[Carga total]])/1000","v":{"v":23.1505489125,"d":"23.15"}},{"v":2.1,"d":"2.10"},2.62,{"$f":"Tabla1[[#This Row],[dmin]]/(Tabla1[[#This Row],[Velod. Avance]]*1000/60)","v":{"v":0.5714285714285714,"d":"0.57"}},{"$f":"Tabla1[[#This Row],[dmin]]/(Tabla1[[#This Row],[Velod. Retroceso]]*1000/60)","v":{"v":0.45801526717557256,"d":"0.46"}},{"$f":"Tabla1[[#This Row],[Power shift]]+Tabla1[[#This Row],[T. Avance]]+Tabla1[[#This Row],[T. Retroceso]]","v":{"v":1.1294438386041439,"d":"1.13"}},0.69,{"$f":"(Tabla1[[#This Row],[Producción por ciclo ]]*60*Tabla1[[#This Row],[Eficiencia]])/Tabla1[[#This Row],[Cm]]","v":{"v":367.40976911508164,"d":"367.41"}}]
["D7E",{"v":26055,"d":"26055.00"},"Orientación",{"v":6.2,"d":"6.200"},{"v":4.5,"d":"4.500"},1.423,0.715,"Carbón ",{"v":1190,"d":"1190.00"},"Empuje promedio",{"$f":"IF(Tabla1[[#This Row],[Nivel de empuje]]=\"Empuje facil\",1.1,IF(Tabla1[[#This Row],[Nivel de empuje]]=\"Empuje promedio\",0.9,IF(Tabla1[[#This Row],[Nivel de empuje]]=\"Empuje medio dificultoso\",0.7,IF(Tabla1[[#This Row],[Nivel de empuje]]=\"Empuje dificultoso\",0.6,\" \"))))","v":{"v":0.9,"d":"0.90"}},{"v":0.6,"d":"0.60"},{"$f":"Tabla1[[#This Row],[Ancho ]]*(Tabla1[[#This Row],[Altura ]]^2)*Tabla1[[#This Row],[Factor Hoja]]","v":{"v":8.20096245,"d":"8.201"}},{"$f":"Tabla1[[#This Row],[Producción por ciclo ]]/(Tabla1[[#This Row],[Profundidad]]*Tabla1[[#This Row],[Ancho ]])","v":{"v":2.5488616783216784,"d":"2.55"}},{"$f":"MROUND(3*Tabla1[[#This Row],[Longitud ]],10)","v":{"v":20,"d":"20.00"}},{"$f":"Tabla1[[#This Row],[Producción por ciclo ]]/(Tabla1[[#This Row],[dmin]]*Tabla1[[#This Row],[Ancho ]])","v":{"v":0.091121805,"d":"0.0911"}},{"$f":"IF(Tabla1[[#This Row],[Profundidad]]>Tabla1[[#This Row],[Profundidad de trabajo ]],\"Conforme\",\"No conforme\")","v":"Conforme"},{"$f":"Tabla1[[#This Row],[Densidad ]]*Tabla1[[#This Row],[Producción por ciclo ]]","v":{"v":9759.1453155,"d":"9759.15"}},{"v":0.1,"d":"0.10"},{"$f":"Tabla1[[#This Row],[Peso ]]+Tabla1[[#This Row],[Peso de material]]","v":{"v":35814.1453155,"d":"35814.15"}},{"$f":"(Tabla1[[#This Row],[Factor de tracción ]]*Tabla1[[#This Row],[Carga total]])/1000","v":{"v":21.4884871893,"d":"21.49"}},{"v":2.3,"d":"2.30"},2.62,{"$f":"Tabla1[[#This Row],[dmin]]/(Tabla1[[#This Row],[Velod. Avance]]*1000/60)","v":{"v":0.5217391304347826,"d":"0.52"}},{"$f":"Tabla1[[#This Row],[dmin]]/(Tabla1[[#This Row],[Velod. Retroceso]]*1000/60)","v":{"v":0.45801526717557256,"d":"0.46"}},{"$f":"Tabla1[[#This Row],[Power shift]]+Tabla1[[#This Row],[T. Avance]]+Tabla1[[#This Row],[T. Retroceso]]","v":{"v":1.0797543976103552,"d":"1.08"}},0.69,{"$f":"(Tabla1[[#This Row],[Producción por ciclo ]]*60*Tabla1[[#This Row],[Eficiencia]])/Tabla1[[#This Row],[Cm]]","v":{"v":314.44173432532807,"d":"314.44"}}]
["D7E",{"v":26055,"d":"26055.00"},"Recta ",{"v":5.92,"d":"5.920"},{"v":3.9,"d":"3.900"},1.522,0.555,"Concreto ",{"v":2400,"d":"2400.00"},"Empuje dificultoso",{"$f":"IF(Tabla1[[#This Row],[Nivel de empuje]]=\"Empuje facil\",1.1,IF(Tabla1[[#This Row],[Nivel de empuje]]=\"Empuje promedio\",0.9,IF(Tabla1[[#This Row],[Nivel de empuje]]=\"Empuje medio dificultoso\",0.7,IF(Tabla1[[#This Row],[Nivel de empuje]]=\"Empuje dificultoso\",0.6,\" \"))))","v":{"v":0.6,"d":"0.60"}},0.45,{"$f":"Tabla1[[#This Row],[Ancho ]]*(Tabla1[[#This Row],[Altura ]]^2)*Tabla1[[#This Row],[Factor Hoja]]","v":{"v":5.420572559999999,"d":"5.421"}},{"$f":"Tabla1[[#This Row],[Producción por ciclo ]]/(Tabla1[[#This Row],[Profundidad]]*Tabla1[[#This Row],[Ancho ]])","v":{"v":2.5043070270270262,"d":"2.50"}},{"$f":"MROUND(3*Tabla1[[#This Row],[Longitud ]],10)","v":{"v":20,"d":"20.00"}},{"$f":"Tabla1[[#This Row],[Producción por ciclo ]]/(Tabla1[[#This Row],[dmin]]*Tabla1[[#This Row],[Ancho ]])","v":{"v":0.06949451999999999,"d":"0.0695"}},{"$f":"IF(Tabla1[[#This Row],[Profundidad]]>Tabla1[[#This Row],[Profundidad de trabajo ]],\"Conforme\",\"No conforme\")","v":"Conforme"},{"$f":"Tabla1[[#This Row],[Densidad ]]*Tabla1[[#This Row],[Producción por ciclo ]]","v":{"v":13009.374143999998,"d":"13009.37"}},{"v":0.1,"d":"0.10"},{"$f":"Tabla1[[#This Row],[Peso ]]+Tabla1[[#This Row],[Peso de material]]","v":{"v":39064.374144,"d":"39064.37"}},{"$f":"(Tabla1[[#This Row],[Factor de tracción ]]*Tabla1[[#This Row],[Carga total]])/1000","v":{"v":17.5789683648,"d":"17.58"}},{"v":3.2,"d":"3.20"},2.62,{"$f":"Tabla1[[#This Row],[dmin]]/(Tabla1[[#This Row],[Velod. Avance]]*1000/60)","v":{"v":0.375,"d":"0.38"}},{"$f":"Tabla1[[#This Row],[dmin]]/(Tabla1[[#This Row],[Velod. Retroceso]]*1000/60)","v":{"v":0.45801526717557256,"d":"0.46"}},{"$f":"Tabla1[[#This Row],[Power shift]]+Tabla1[[#This Row],[T. Avance]]+Tabla1[[#This Row],[T. Retroceso]]","v":{"v":0.9330152671755725,"d":"0.93"}},0.69,{"$f":"(Tabla1[[#This Row],[Producción por ciclo ]]*60*Tabla1[[#This Row],[Eficiencia]])/Tabla1[[#This Row],[Cm]]","v":{"v":240.52307810925748,"d":"240.52"}}]
["D7E",{"v":26055,"d":"26055.00"},"Recta ",{"v":5.92,"d":"5.920"},{"v":3.9,"d":"3.900"},1.522,0.555,"Arcilla seca ",{"v":1480,"d":"1480.00"},"Empuje medio dificultoso",{"$f":"IF(Tabla1[[#This Row],[Nivel de empuje]]=\"Empuje facil\",1.1,IF(Tabla1[[#This Row],[Nivel de empuje]]=\"Empuje promedio\",0.9,IF(Tabla1[[#This Row],[Nivel de empuje]]=\"Empuje medio dificultoso\",0.7,IF(Tabla1[[#This Row],[Nivel de empuje]]=\"Empuje dificultoso\",0.6,\" \"))))","v":{"v":0.7,"d":"0.70"}},{"v":0.9,"d":"0.90"},{"$f":"Tabla1[[#This Row],[Ancho ]]*(Tabla1[[#This Row],[Altura ]]^2)*Tabla1[[#This Row],[Factor Hoja]]","v":{"v":6.324001319999999,"d":"6.324"}},{"$f":"Tabla1[[#This Row],[Producción por ciclo ]]/(Tabla1[[#This Row],[Profundidad]]*Tabla1[[#This Row],[Ancho ]])","v":{"v":2.921691531531531,"d":"2.92"}},{"$f":"MROUND(3*Tabla1[[#This Row],[Longitud ]],10)","v":{"v":20,"d":"20.00"}},{"$f":"Tabla1[[#This Row],[Producción por ciclo ]]/(Tabla1[[#This Row],[dmin]]*Tabla1[[#This Row],[Ancho ]])","v":{"v":0.08107693999999999,"d":"0.0811"}},{"$f":"IF(Tabla1[[#This Row],[Profundidad]]>Tabla1[[#This Row],[Profundidad de trabajo ]],\"Conforme\",\"No conforme\")","v":"Conforme"},{"$f":"Tabla1[[#This Row],[Densidad ]]*Tabla1[[#This Row],[Producción por ciclo ]]","v":{"v":9359.521953599999,"d":"9359.52"}},{"v":0.1,"d":"0.10"},{"$f":"Tabla1[[#This Row],[Peso ]]+Tabla1[[#This Row],[Peso de material]]","v":{"v":35414.5219536,"d":"35414.52"}},{"$f":"(Tabla1[[#This Row],[Factor de tracción ]]*Tabla1[[#This Row],[Carga total]])/1000","v":{"v":31.873069758240003,"d":"31.87"}},{"v":1.2,"d":"1.20"},2.62,{"$f":"Tabla1[[#This Row],[dmin]]/(Tabla1[[#This Row],[Velod. Avance]]*1000/60)","v":{"v":1,"d":"1.00"}},{"$f":"Tabla1[[#This Row],[dmin]]/(Tabla1[[#This Row],[Velod. Retroceso]]*1000/60)","v":{"v":0.45801526717557256,"d":"0.46"}},{"$f":"Tabla1[[#This Row],[Power shift]]+Tabla1[[#This Row],[T. Avance]]+Tabla1[[#This Row],[T. Retroceso]]","v":{"v":1.5580152671755727,"d":"1.56"}},0.69,{"$f":"(Tabla1[[#This Row],[Producción por ciclo ]]*60*Tabla1[[#This Row],[Eficiencia]])/Tabla1[[#This Row],[Cm]]","v":{"v":168.04306104305726,"d":"168.04"}}]
["D7E",{"v":26055,"d":"26055.00"},"Recta ",{"v":5.92,"d":"5.920"},{"v":3.9,"d":"3.900"},1.522,0.555,"Arcilla húmeda",{"v":1660,"d":"1660.00"},"Empuje facil",{"$f":"IF(Tabla1[[#This Row],[Nivel de empuje]]=\"Empuje facil\",1.1,IF(Tabla1[[#This Row],[Nivel de empuje]]=\"Empuje promedio\",0.9,IF(Tabla1[[#This Row],[Nivel de empuje]]=\"Empuje medio dificultoso\",0.7,IF(Tabla1[[#This Row],[Nivel de empuje]]=\"Empuje dificultoso\",0.6,\" \"))))","v":{"v":1.1,"d":"1.10"}},{"v":0.7,"d":"0.70"},{"$f":"Tabla1[[#This Row],[Ancho ]]*(Tabla1[[#This Row],[Altura ]]^2)*Tabla1[[#This Row],[Factor Hoja]]","v":{"v":9.93771636,"d":"9.938"}},{"$f":"Tabla1[[#This Row],[Producción por ciclo ]]/(Tabla1[[#This Row],[Profundidad]]*Tabla1[[#This Row],[Ancho ]])","v":{"v":4.591229549549548,"d":"4.59"}},{"$f":"MROUND(3*Tabla1[[#This Row],[Longitud ]],10)","v":{"v":20,"d":"20.00"}},{"$f":"Tabla1[[#This Row],[Producción por ciclo ]]/(Tabla1[[#This Row],[dmin]]*Tabla1[[#This Row],[Ancho ]])","v":{"v":0.12740662,"d":"0.1274"}},{"$f":"IF(Tabla1[[#This Row],[Profundidad]]>Tabla1[[#This Row],[Profundidad de trabajo ]],\"Conforme\",\"No conforme\")","v":"Conforme"},{"$f":"Tabla1[[#This Row],[Densidad ]]*Tabla1[[#This Row],[Producción por ciclo ]]","v":{"v":16496.6091576,"d":"16496.61"}},{"v":0.1,"d":"0.10"},{"$f":"Tabla1[[#This Row],[Peso ]]+Tabla1[[#This Row],[Peso de material]]","v":{"v":42551.6091576,"d":"42551.61"}},{"$f":"(Tabla1[[#This Row],[Factor de tracción ]]*Tabla1[[#This Row],[Carga total]])/1000","v":{"v":29.78612641032,"d":"29.79"}},{"v":1.4,"d":"1.40"},2.62,{"$f":"Tabla1[[#This Row],[dmin]]/(Tabla1[[#This Row],[Velod. Avance]]*1000/60)","v":{"v":0.8571428571428572,"d":"0.86"}},{"$f":"Tabla1[[#This Row],[dmin]]/(Tabla1[[#This Row],[Velod. Retroceso]]*1000/60)","v":{"v":0.45801526717557256,"d":"0.46"}},{"$f":"Tabla1[[#This Row],[Power shift]]+Tabla1[[#This Row],[T. Avance]]+Tabla1[[#This Row],[T. Retroceso]]","v":{"v":1.4151581243184297,"d":"1.42"}},0.69,{"$f":"(Tabla1[[#This Row],[Producción por ciclo ]]*60*Tabla1[[#This Row],[Eficiencia]])/Tabla1[[#This Row],[Cm]]","v":{"v":290.7247255511813,"d":"290.72"}}]
["D7E",{"v":26055,"d":"26055.00"},"Recta ",{"v":5.92,"d":"5.920"},{"v":3.9,"d":"3.900"},1.522,0.555,"Arena seca ",{"v":1420,"d":"1420.00"},"Empuje facil",{"$f":"IF(Tabla1[[#This Row],[Nivel de empuje]]=\"Empuje facil\",1.1,IF(Tabla1[[#This Row],[Nivel de empuje]]=\"Empuje promedio\",0.9,IF(Tabla1[[#This Row],[Nivel de empuje]]=\"Empuje medio dificultoso\",0.7,IF(Tabla1[[#This Row],[Nivel de empuje]]=\"Empuje dificultoso\",0.6,\" \"))))","v":{"v":1.1,"d":"1.10"}},0.39,{"$f":"Tabla1[[#This Row],[Ancho ]]*(Tabla1[[#This Row],[Altura ]]^2)*Tabla1[[#This Row],[Factor Hoja]]","v":{"v":9.93771636,"d":"9.938"}},{"$f":"Tabla1[[#This Row],[Producción por ciclo ]]/(Tabla1[[#This Row],[Profundidad]]*Tabla1[[#This Row],[Ancho ]])","v":{"v":4.591229549549548,"d":"4.59"}},{"$f":"MROUND(3*Tabla1[[#This Row],[Longitud ]],10)","v":{"v":20,"d":"20.00"}},{"$f":"Tabla1[[#This Row],[Producción por ciclo ]]/(Tabla1[[#This Row],[dmin]]*Tabla1[[#This Row],[Ancho ]])","v":{"v":0.12740662,"d":"0.1274"}},{"$f":"IF(Tabla1[[#This Row],[Profundidad]]>Tabla1[[#This Row],[Profundidad de trabajo ]],\"Conforme\",\"No conforme\")","v":"Conforme"},{"$f":"Tabla1[[#This Row],[Densidad ]]*Tabla1[[#This Row],[Producción por ciclo ]]","v":{"v":14111.557231199999,"d":"14111.56"}},{"v":0.1,"d":"0.10"},{"$f":"Tabla1[[#This Row],[Peso ]]+Tabla1[[#This Row],[Peso de material]]","v":{"v":40166.5572312,"d":"40166.56"}},{"$f":"(Tabla1[[#This Row],[Factor de tracción ]]*Tabla1[[#This Row],[Carga total]])/1000","v":{"v":15.664957320168002,"d":"15.66"}},3.05,2.62,{"$f":"Tabla1[[#This Row],[dmin]]/(Tabla1[[#This Row],[Velod. Avance]]*1000/60)","v":{"v":0.39344262295081966,"d":"0.39"}},{"$f":"Tabla1[[#This Row],[dmin]]/(Tabla1[[#This Row],[Velod. Retroceso]]*1000/60)","v":{"v":0.45801526717557256,"d":"0.46"}},{"$f":"Tabla1[[#This Row],[Power shift]]+Tabla1[[#This Row],[T. Avance]]+Tabla1[[#This Row],[T. Retroceso]]","v":{"v":0.9514578901263921,"d":"0.95"}},0.69,{"$f":"(Tabla1[[#This Row],[Producción por ciclo ]]*60*Tabla1[[#This Row],[Eficiencia]])/Tabla1[[#This Row],[Cm]]","v":{"v":432.41163016615116,"d":"432.41"}}]
["D7E",{"v":26055,"d":"26055.00"},"Recta ",{"v":5.92,"d":"5.920"},{"v":3.9,"d":"3.900"},1.522,0.555,"Arena húmeda ",{"v":1690,"d":"1690.00"},"Empuje medio dificultoso",{"$f":"IF(Tabla1[[#This Row],[Nivel de empuje]]=\"Empuje facil\",1.1,IF(Tabla1[[#This Row],[Nivel de empuje]]=\"Empuje promedio\",0.9,IF(Tabla1[[#This Row],[Nivel de empuje]]=\"Empuje medio dificultoso\",0.7,IF(Tabla1[[#This Row],[Nivel de empuje]]=\"Empuje dificultoso\",0.6,\" \"))))","v":{"v":0.7,"d":"0.70"}},{"v":0.5,"d":"0.50"},{"$f":"Tabla1[[#This Row],[Ancho ]]*(Tabla1[[#This Row],[Altura ]]^2)*Tabla1[[#This Row],[Factor Hoja]]","v":{"v":6.324001319999999,"d":"6.324"}},{"$f":"Tabla1[[#This Row],[Producción por ciclo ]]/(Tabla1[[#This Row],[Profundidad]]*Tabla1[[#This Row],[Ancho ]])","v":{"v":2.921691531531531,"d":"2.92"}},{"$f":"MROUND(3*Tabla1[[#This Row],[Longitud ]],10)","v":{"v":20,"d":"20.00"}},{"$f":"Tabla1[[#This Row],[Producción por ciclo ]]/(Tabla1[[#This Row],[dmin]]*Tabla1[[#This Row],[Ancho ]])","v":{"v":0.08107693999999999,"d":"0.0811"}},{"$f":"IF(Tabla1[[#This Row],[Profundidad]]>Tabla1[[#This Row],[Profundidad de trabajo ]],\"Conforme\",\"No conforme\")","v":"Conforme"},{"$f":"Tabla1[[#This Row],[Densidad ]]*Tabla1[[#This Row],[Producción por ciclo ]]","v":{"v":10687.562230799998,"d":"10687.56"}},{"v":0.1,"d":"0.10"},{"$f":"Tabla1[[#This Row],[Peso ]]+Tabla1[[#This Row],[Peso de material]]","v":{"v":36742.5622308,"d":"36742.56"}},{"$f":"(Tabla1[[#This Row],[Factor de tracción ]]*Tabla1[[#This Row],[Carga total]])/1000","v":{"v":18.371281115400002,"d":"18.37"}},{"v":2.6,"d":"2.60"},2.62,{"$f":"Tabla1[[#This Row],[dmin]]/(Tabla1[[#This Row],[Velod. Avance]]*1000/60)","v":{"v":0.4615384615384615,"d":"0.46"}},{"$f":"Tabla1[[#This Row],[dmin]]/(Tabla1[[#This Row],[Velod. Retroceso]]*1000/60)","v":{"v":0.45801526717557256,"d":"0.46"}},{"$f":"Tabla1[[#This Row],[Power shift]]+Tabla1[[#This Row],[T. Avance]]+Tabla1[[#This Row],[T. Retroceso]]","v":{"v":1.0195537287140342,"d":"1.02"}},0.69,{"$f":"(Tabla1[[#This Row],[Producción por ciclo ]]*60*Tabla1[[#This Row],[Eficiencia]])/Tabla1[[#This Row],[Cm]]","v":{"v":256.7924056128226,"d":"256.79"}}]
["D7E",{"v":26055,"d":"26055.00"},"Recta ",{"v":5.92,"d":"5.920"},{"v":3.9,"d":"3.900"},1.522,0.555,"Grava suelta ",{"v":1930,"d":"1930.00"},"Empuje promedio",{"$f":"IF(Tabla1[[#This Row],[Nivel de empuje]]=\"Empuje facil\",1.1,IF(Tabla1[[#This Row],[Nivel de empuje]]=\"Empuje promedio\",0.9,IF(Tabla1[[#This Row],[Nivel de empuje]]=\"Empuje medio dificultoso\",0.7,IF(Tabla1[[#This Row],[Nivel de empuje]]=\"Empuje dificultoso\",0.6,\" \"))))","v":{"v":0.9,"d":"0.90"}},{"v":0.5,"d":"0.50"},{"$f":"Tabla1[[#This Row],[Ancho ]]*(Tabla1[[#This Row],[Altura ]]^2)*Tabla1[[#This Row],[Factor Hoja]]","v":{"v":8.13085884,"d":"8.131"}},{"$f":"Tabla1[[#This Row],[Producción por ciclo ]]/(Tabla1[[#This Row],[Profundidad]]*Tabla1[[#This Row],[Ancho ]])","v":{"v":3.75646054054054,"d":"3.76"}},{"$f":"MROUND(3*Tabla1[[#This Row],[Longitud ]],10)","v":{"v":20,"d":"20.00"}},{"$f":"Tabla1[[#This Row],[Producción por ciclo ]]/(Tabla1[[#This Row],[dmin]]*Tabla1[[#This Row],[Ancho ]])","v":{"v":0.10424178,"d":"0.1042"}},{"$f":"IF(Tabla1[[#This Row],[Profundidad]]>Tabla1[[#This Row],[Profundidad de trabajo ]],\"Conforme\",\"No conforme\")","v":"Conforme"},{"$f":"Tabla1[[#This Row],[Densidad ]]*Tabla1[[#This Row],[Producción por ciclo ]]","v":{"v":15692.557561200001,"d":"15692.56"}},{"v":0.1,"d":"0.10"},{"$f":"Tabla1[[#This Row],[Peso ]]+Tabla1[[#This Row],[Peso de material]]","v":{"v":41747.5575612,"d":"41747.56"}},{"$f":"(Tabla1[[#This Row],[Factor de tracción ]]*Tabla1[[#This Row],[Carga total]])/1000","v":{"v":20.873778780600002,"d":"20.87"}},{"v":2.2,"d":"2.20"},2.62,{"$f":"Tabla1[[#This Row],[dmin]]/(Tabla1[[#This Row],[Velod. Avance]]*1000/60)","v":{"v":0.5454545454545455,"d":"0.55"}},{"$f":"Tabla1[[#This Row],[dmin]]/(Tabla1[[#This Row],[Velod. Retroceso]]*1000/60)","v":{"v":0.45801526717557256,"d":"0.46"}},{"$f":"Tabla1[[#This Row],[Power shift]]+Tabla1[[#This Row],[T. Avance]]+Tabla1[[#This Row],[T. Retroceso]]","v":{"v":1.1034698126301181,"d":"1.10"}},0.69,{"$f":"(Tabla1[[#This Row],[Producción por ciclo ]]*60*Tabla1[[#This Row],[Eficiencia]])/Tabla1[[#This Row],[Cm]]","v":{"v":305.0537061577359,"d":"305.05"}}]
["D7E",{"v":26055,"d":"26055.00"},"Recta ",{"v":5.92,"d":"5.920"},{"v":3.9,"d":"3.900"},1.522,0.555,"Nieve compacta",{"v":130,"d":"130.00"},"Empuje medio dificultoso",{"$f":"IF(Tabla1[[#This Row],[Nivel de empuje]]=\"Empuje facil\",1.1,IF(Tabla1[[#This Row],[Nivel de empuje]]=\"Empuje promedio\",0.9,IF(Tabla1[[#This Row],[Nivel de empuje]]=\"Empuje medio dificultoso\",0.7,IF(Tabla1[[#This Row],[Nivel de empuje]]=\"Empuje dificultoso\",0.6,\" \"))))","v":{"v":0.7,"d":"0.70"}},0.27,{"$f":"Tabla1[[#This Row],[Ancho ]]*(Tabla1[[#This Row],[Altura ]]^2)*Tabla1[[#This Row],[Factor Hoja]]","v":{"v":6.324001319999999,"d":"6.324"}},{"$f":"Tabla1[[#This Row],[Producción por ciclo ]]/(Tabla1[[#This Row],[Profundidad]]*Tabla1[[#This Row],[Ancho ]])","v":{"v":2.921691531531531,"d":"2.92"}},{"$f":"MROUND(3*Tabla1[[#This Row],[Longitud ]],10)","v":{"v":20,"d":"20.00"}},{"$f":"Tabla1[[#This Row],[Producción por ciclo ]]/(Tabla1[[#This Row],[dmin]]*Tabla1[[#This Row],[Ancho ]])","v":{"v":0.08107693999999999,"d":"0.0811"}},{"$f":"IF(Tabla1[[#This Row],[Profundidad]]>Tabla1[[#This Row],[Profundidad de trabajo ]],\"Conforme\",\"No conforme\")","v":"Conforme"},{"$f":"Tabla1[[#This Row],[Densidad ]]*Tabla1[[#This Row],[Producción por ciclo ]]","v":{"v":822.1201715999998,"d":"822.12"}},{"v":0.1,"d":"0.10"},{"$f":"Tabla1[[#This Row],[Peso ]]+Tabla1[[#This Row],[Peso de material]]","v":{"v":26877.1201716,"d":"26877.12"}},{"$f":"(Tabla1[[#This Row],[Factor de tracción ]]*Tabla1[[#This Row],[Carga total]])/1000","v":{"v":7.256822446332,"d":"7.26"}},{"v":7,"d":"7.00"},2.62,{"$f":"Tabla1[[#This Row],[dmin]]/(Tabla1[[#This Row],[Velod. Avance]]*1000/60)","v":{"v":0.17142857142857143,"d":"0.17"}},{"$f":"Tabla1[[#This Row],[dmin]]/(Tabla1[[#This Row],[Velod. Retroceso]]*1000/60)","v":{"v":0.45801526717557256,"d":"0.46"}},{"$f":"Tabla1[[#This Row],[Power shift]]+Tabla1[[#This Row],[T. Avance]]+Tabla1[[#This Row],[T. Retroceso]]","v":{"v":0.729443838604144,"d":"0.73"}},0.69,{"$f":"(Tabla1[[#This Row],[Producción por ciclo ]]*60*Tabla1[[#This Row],[Eficiencia]])/Tabla1[[#This Row],[Cm]]","v":{"v":358.9222922891553,"d":"358.92"}}]
["D7E",{"v":26055,"d":"26055.00"},"Recta ",{"v":5.92,"d":"5.920"},{"v":3.9,"d":"3.900"},1.522,0.555,"Hielo ",{"v":520,"d":"520.00"},"Empuje dificultoso",{"$f":"IF(Tabla1[[#This Row],[Nivel de empuje]]=\"Empuje facil\",1.1,IF(Tabla1[[#This Row],[Nivel de empuje]]=\"Empuje promedio\",0.9,IF(Tabla1[[#This Row],[Nivel de empuje]]=\"Empuje medio dificultoso\",0.7,IF(Tabla1[[#This Row],[Nivel de empuje]]=\"Empuje dificultoso\",0.6,\" \"))))","v":{"v":0.6,"d":"0.60"}},0.12,{"$f":"Tabla1[[#This Row],[Ancho ]]*(Tabla1[[#This Row],[Altura ]]^2)*Tabla1[[#This Row],[Factor Hoja]]","v":{"v":5.420572559999999,"d":"5.421"}},{"$f":"Tabla1[[#This Row],[Producción por ciclo ]]/(Tabla1[[#This Row],[Profundidad]]*Tabla1[[#This Row],[Ancho ]])","v":{"v":2.5043070270270262,"d":"2.50"}},{"$f":"MROUND(3*Tabla1[[#This Row],[Longitud ]],10)","v":{"v":20,"d":"20.00"}},{"$f":"Tabla1[[#This Row],[Producción por ciclo ]]/(Tabla1[[#This Row],[dmin]]*Tabla1[[#This Row],[Ancho ]])","v":{"v":0.06949451999999999,"d":"0.0695"}},{"$f":"IF(Tabla1[[#This Row],[Profundidad]]>Tabla1[[#This Row],[Profundidad de trabajo ]],\"Conforme\",\"No conforme\")","v":"Conforme"},{"$f":"Tabla1[[#This Row],[Densidad ]]*Tabla1[[#This Row],[Producción por ciclo ]]","v":{"v":2818.6977311999995,"d":"2818.70"}},{"v":0.1,"d":"0.10"},{"$f":"Tabla1[[#This Row],[Peso ]]+Tabla1[[#This Row],[Peso de material]]","v":{"v":28873.697731199998,"d":"28873.70"}},{"$f":"(Tabla1[[#This Row],[Factor de tracción ]]*Tabla1[[#This Row],[Carga total]])/1000","v":{"v":3.464843727744,"d":"3.46"}},{"v":11,"d":"11.00"},2.62,{"$f":"Tabla1[[#This Row],[dmin]]/(Tabla1[[#This Row],[Velod. Avance]]*1000/60)","v":{"v":0.10909090909090909,"d":"0.11"}},{"$f":"Tabla1[[#This Row],[dmin]]/(Tabla1[[#This Row],[Velod. Retroceso]]*1000/60)","v":{"v":0.45801526717557256,"d":"0.46"}},{"$f":"Tabla1[[#This Row],[Power shift]]+Tabla1[[#This Row],[T. Avance]]+Tabla1[[#This Row],[T. Retroceso]]","v":{"v":0.6671061762664816,"d":"0.67"}},0.69,{"$f":"(Tabla1[[#This Row],[Producción por ciclo ]]*60*Tabla1[[#This Row],[Eficiencia]])/Tabla1[[#This Row],[Cm]]","v":{"v":336.3957822125704,"d":"336.40"}}]
["D7E",{"v":26055,"d":"26055.00"},"Recta ",{"v":5.92,"d":"5.920"},{"v":3.9,"d":"3.900"},1.522,0.555,"Tierra firme ",{"v":1510,"d":"1510.00"},"Empuje facil",{"$f":"IF(Tabla1[[#This Row],[Nivel de empuje]]=\"Empuje facil\",1.1,IF(Tabla1[[#This Row],[Nivel de empuje]]=\"Empuje promedio\",0.9,IF(Tabla1[[#This Row],[Nivel de empuje]]=\"Empuje medio dificultoso\",0.7,IF(Tabla1[[#This Row],[Nivel de empuje]]=\"Empuje dificultoso\",0.6,\" \"))))","v":{"v":1.1,"d":"1.10"}},{"v":0.9,"d":"0.90"},{"$f":"Tabla1[[#This Row],[Ancho ]]*(Tabla1[[#This Row],[Altura ]]^2)*Tabla1[[#This Row],[Factor Hoja]]","v":{"v":9.93771636,"d":"9.938"}},{"$f":"Tabla1[[#This Row],[Producción por ciclo ]]/(Tabla1[[#This Row],[Profundidad]]*Tabla1[[#This Row],[Ancho ]])","v":{"v":4.591229549549548,"d":"4.59"}},{"$f":"MROUND(3*Tabla1[[#This Row],[Longitud ]],10)","v":{"v":20,"d":"20.00"}},{"$f":"Tabla1[[#This Row],[Producción por ciclo ]]/(Tabla1[[#This Row],[dmin]]*Tabla1[[#This Row],[Ancho ]])","v":{"v":0.12740662,"d":"0.1274"}},{"$f":"IF(Tabla1[[#This Row],[Profundidad]]>Tabla1[[#This Row],[Profundidad de trabajo ]],\"Conforme\",\"No conforme\")","v":"Conforme"},{"$f":"Tabla1[[#This Row],[Densidad ]]*Tabla1[[#This Row],[Producción por ciclo ]]","v":{"v":15005.9517036,"d":"15005.95"}},{"v":0.1,"d":"0.10"},{"$f":"Tabla1[[#This Row],[Peso ]]+Tabla1[[#This Row],[Peso de material]]","v":{"v":41060.9517036,"d":"41060.95"}},{"$f":"(Tabla1[[#This Row],[Factor de tracción ]]*Tabla1[[#This Row],[Carga total]])/1000","v":{"v":36.954856533240005,"d":"36.95"}},{"v":0.9,"d":"0.90"},2.62,{"$f":"Tabla1[[#This Row],[dmin]]/(Tabla1[[#This Row],[Velod. Avance]]*1000/60)","v":{"v":1.3333333333333333,"d":"1.33"}},{"$f":"Tabla1[[#This Row],[dmin]]/(Tabla1[[#This Row],[Velod. Retroceso]]*1000/60)","v":{"v":0.45801526717557256,"d":"0.46"}},{"$f":"Tabla1[[#This Row],[Power shift]]+Tabla1[[#This Row],[T. Avance]]+Tabla1[[#This Row],[T. Retroceso]]","v":{"v":1.891348600508906,"d":"1.89"}},0.69,{"$f":"(Tabla1[[#This Row],[Producción por ciclo ]]*60*Tabla1[[#This Row],[Eficiencia]])/Tabla1[[#This Row],[Cm]]","v":{"v":217.5280946057742,"d":"217.53"}}]
["D7E",{"v":26055,"d":"26055.00"},"Recta ",{"v":5.92,"d":"5.920"},{"v":3.9,"d":"3.900"},1.522,0.555,"Tierra suelta ",{"v":1250,"d":"1250.00"},"Empuje facil",{"$f":"IF(Tabla1[[#This Row],[Nivel de empuje]]=\"Empuje facil\",1.1,IF(Tabla1[[#This Row],[Nivel de empuje]]=\"Empuje promedio\",0.9,IF(Tabla1[[#This Row],[Nivel de empuje]]=\"Empuje medio dificultoso\",0.7,IF(Tabla1[[#This Row],[Nivel de empuje]]=\"Empuje dificultoso\",0.6,\" \"))))","v":{"v":1.1,"d":"1.10"}},{"v":0.6,"d":"0.60"},{"$f":"Tabla1[[#This Row],[Ancho ]]*(Tabla1[[#This Row],[Altura ]]^2)*Tabla1[[#This Row],[Factor Hoja]]","v":{"v":9.93771636,"d":"9.938"}},{"$f":"Tabla1[[#This Row],[Producción por ciclo ]]/(Tabla1[[#This Row],[Profundidad]]*Tabla1[[#This Row],[Ancho ]])","v":{"v":4.591229549549548,"d":"4.59"}},{"$f":"MROUND(3*Tabla1[[#This Row],[Longitud ]],10)","v":{"v":20,"d":"20.00"}},{"$f":"Tabla1[[#This Row],[Producción por ciclo ]]/(Tabla1[[#This Row],[dmin]]*Tabla1[[#This Row],[Ancho ]])","v":{"v":0.12740662,"d":"0.1274"}},{"$f":"IF(Tabla1[[#This Row],[Profundidad]]>Tabla1[[#This Row],[Profundidad de trabajo ]],\"Conforme\",\"No conforme\")","v":"Conforme"},{"$f":"Tabla1[[#This Row],[Densidad ]]*Tabla1[[#This Row],[Producción por ciclo ]]","v":{"v":12422.14545,"d":"12422.15"}},{"v":0.1,"d":"0.10"},{"$f":"Tabla1[[#This Row],[Peso ]]+Tabla1[[#This Row],[Peso de material]]","v":{"v":38477.145449999996,"d":"38477.15"}},{"$f":"(Tabla1[[#This Row],[Factor de tracción ]]*Tabla1[[#This Row],[Carga total]])/1000","v":{"v":23.086287269999996,"d":"23.09"}},2.05,2.62,{"$f":"Tabla1[[#This Row],[dmin]]/(Tabla1[[#This Row],[Velod. Avance]]*1000/60)","v":{"v":0.5853658536585367,"d":"0.59"}},{"$f":"Tabla1[[#This Row],[dmin]]/(Tabla1[[#This Row],[Velod. Retroceso]]*1000/60)","v":{"v":0.45801526717557256,"d":"0.46"}},{"$f":"Tabla1[[#This Row],[Power shift]]+Tabla1[[#This Row],[T. Avance]]+Tabla1[[#This Row],[T. Retroceso]]","v":{"v":1.1433811208341091,"d":"1.14"}},0.69,{"$f":"(Tabla1[[#This Row],[Producción por ciclo ]]*60*Tabla1[[#This Row],[Eficiencia]])/Tabla1[[#This Row],[Cm]]","v":{"v":359.82880056989524,"d":"359.83"}}]
["D7E",{"v":26055,"d":"26055.00"},"Recta ",{"v":5.92,"d":"5.920"},{"v":3.9,"d":"3.900"},1.522,0.555,"Carbón ",{"v":1190,"d":"1190.00"},"Empuje promedio",{"$f":"IF(Tabla1[[#This Row],[Nivel de empuje]]=\"Empuje facil\",1.1,IF(Tabla1[[#This Row],[Nivel de empuje]]=\"Empuje promedio\",0.9,IF(Tabla1[[#This Row],[Nivel de empuje]]=\"Empuje medio dificultoso\",0.7,IF(Tabla1[[#This Row],[Nivel de empuje]]=\"Empuje dificultoso\",0.6,\" \"))))","v":{"v":0.9,"d":"0.90"}},{"v":0.6,"d":"0.60"},{"$f":"Tabla1[[#This Row],[Ancho ]]*(Tabla1[[#This Row],[Altura ]]^2)*Tabla1[[#This Row],[Factor Hoja]]","v":{"v":8.13085884,"d":"8.131"}},{"$f":"Tabla1[[#This Row],[Producción por ciclo ]]/(Tabla1[[#This Row],[Profundidad]]*Tabla1[[#This Row],[Ancho ]])","v":{"v":3.75646054054054,"d":"3.76"}},{"$f":"MROUND(3*Tabla1[[#This Row],[Longitud ]],10)","v":{"v":20,"d":"20.00"}},{"$f":"Tabla1[[#This Row],[Producción por ciclo ]]/(Tabla1[[#This Row],[dmin]]*Tabla1[[#This Row],[Ancho ]])","v":{"v":0.10424178,"d":"0.1042"}},{"$f":"IF(Tabla1[[#This Row],[Profundidad]]>Tabla1[[#This Row],[Profundidad de trabajo ]],\"Conforme\",\"No conforme\")","v":"Conforme"},{"$f":"Tabla1[[#This Row],[Densidad ]]*Tabla1[[#This Row],[Producción por ciclo ]]","v":{"v":9675.7220196,"d":"9675.72"}},{"v":0.1,"d":"0.10"},{"$f":"Tabla1[[#This Row],[Peso ]]+Tabla1[[#This Row],[Peso de material]]","v":{"v":35730.7220196,"d":"35730.72"}},{"$f":"(Tabla1[[#This Row],[Factor de tracción ]]*Tabla1[[#This Row],[Carga total]])/1000","v":{"v":21.43843321176,"d":"21.44"}},{"v":1.4,"d":"1.40"},2.62,{"$f":"Tabla1[[#This Row],[dmin]]/(Tabla1[[#This Row],[Velod. Avance]]*1000/60)","v":{"v":0.8571428571428572,"d":"0.86"}},{"$f":"Tabla1[[#This Row],[dmin]]/(Tabla1[[#This Row],[Velod. Retroceso]]*1000/60)","v":{"v":0.45801526717557256,"d":"0.46"}},{"$f":"Tabla1[[#This Row],[Power shift]]+Tabla1[[#This Row],[T. Avance]]+Tabla1[[#This Row],[T. Retroceso]]","v":{"v":1.4151581243184297,"d":"1.42"}},0.69,{"$f":"(Tabla1[[#This Row],[Producción por ciclo ]]*60*Tabla1[[#This Row],[Eficiencia]])/Tabla1[[#This Row],[Cm]]","v":{"v":237.8656845418756,"d":"237.87"}}]
["D7E",{"v":26055,"d":"26055.00"},"Semi universal",{"v":6.17,"d":"6.170"},{"v":3.71,"d":"3.710"},1.524,0.555,"Concreto ",{"v":2400,"d":"2400.00"},"Empuje dificultoso",{"$f":"IF(Tabla1[[#This Row],[Nivel de empuje]]=\"Empuje facil\",1.1,IF(Tabla1[[#This Row],[Nivel de empuje]]=\"Empuje promedio\",0.9,IF(Tabla1[[#This Row],[Nivel de empuje]]=\"Empuje medio dificultoso\",0.7,IF(Tabla1[[#This Row],[Nivel de empuje]]=\"Empuje dificultoso\",0.6,\" \"))))","v":{"v":0.6,"d":"0.60"}},0.45,{"$f":"Tabla1[[#This Row],[Ancho ]]*(Tabla1[[#This Row],[Altura ]]^2)*Tabla1[[#This Row],[Factor Hoja]]","v":{"v":5.170054176,"d":"5.170"}},{"$f":"Tabla1[[#This Row],[Producción por ciclo ]]/(Tabla1[[#This Row],[Profundidad]]*Tabla1[[#This Row],[Ancho ]])","v":{"v":2.510892972972973,"d":"2.51"}},{"$f":"MROUND(3*Tabla1[[#This Row],[Longitud ]],10)","v":{"v":20,"d":"20.00"}},{"$f":"Tabla1[[#This Row],[Producción por ciclo ]]/(Tabla1[[#This Row],[dmin]]*Tabla1[[#This Row],[Ancho ]])","v":{"v":0.06967728,"d":"0.0697"}},{"$f":"IF(Tabla1[[#This Row],[Profundidad]]>Tabla1[[#This Row],[Profundidad de trabajo ]],\"Conforme\",\"No conforme\")","v":"Conforme"},{"$f":"Tabla1[[#This Row],[Densidad ]]*Tabla1[[#This Row],[Producción por ciclo ]]","v":{"v":12408.130022399999,"d":"12408.13"}},{"v":0.1,"d":"0.10"},{"$f":"Tabla1[[#This Row],[Peso ]]+Tabla1[[#This Row],[Peso de material]]","v":{"v":38463.1300224,"d":"38463.13"}},{"$f":"(Tabla1[[#This Row],[Factor de tracción ]]*Tabla1[[#This Row],[Carga total]])/1000","v":{"v":17.30840851008,"d":"17.31"}},2.05,2.62,{"$f":"Tabla1[[#This Row],[dmin]]/(Tabla1[[#This Row],[Velod. Avance]]*1000/60)","v":{"v":0.5853658536585367,"d":"0.59"}},{"$f":"Tabla1[[#This Row],[dmin]]/(Tabla1[[#This Row],[Velod. Retroceso]]*1000/60)","v":{"v":0.45801526717557256,"d":"0.46"}},{"$f":"Tabla1[[#This Row],[Power shift]]+Tabla1[[#This Row],[T. Avance]]+Tabla1[[#This Row],[T. Retroceso]]","v":{"v":1.1433811208341091,"d":"1.14"}},0.69,{"$f":"(Tabla1[[#This Row],[Producción por ciclo ]]*60*Tabla1[[#This Row],[Eficiencia]])/Tabla1[[#This Row],[Cm]]","v":{"v":187.19938521484008,"d":"187.20"}}]
["D7E",{"v":26055,"d":"26055.00"},"Semi universal",{"v":6.17,"d":"6.170"},{"v":3.71,"d":"3.710"},1.524,0.555,"Arcilla seca ",{"v":1480,"d":"1480.00"},"Empuje medio dificultoso",{"$f":"IF(Tabla1[[#This Row],[Nivel de empuje]]=\"Empuje facil\",1.1,IF(Tabla1[[#This Row],[Nivel de empuje]]=\"Empuje promedio\",0.9,IF(Tabla1[[#This Row],[Nivel de empuje]]=\"Empuje medio dificultoso\",0.7,IF(Tabla1[[#This Row],[Nivel de empuje]]=\"Empuje dificultoso\",0.6,\" \"))))","v":{"v":0.7,"d":"0.70"}},{"v":0.9,"d":"0.90"},{"$f":"Tabla1[[#This Row],[Ancho ]]*(Tabla1[[#This Row],[Altura ]]^2)*Tabla1[[#This Row],[Factor Hoja]]","v":{"v":6.031729872,"d":"6.032"}},{"$f":"Tabla1[[#This Row],[Producción por ciclo ]]/(Tabla1[[#This Row],[Profundidad]]*Tabla1[[#This Row],[Ancho ]])","v":{"v":2.929375135135135,"d":"2.93"}},{"$f":"MROUND(3*Tabla1[[#This Row],[Longitud ]],10)","v":{"v":20,"d":"20.00"}},{"$f":"Tabla1[[#This Row],[Producción por ciclo ]]/(Tabla1[[#This Row],[dmin]]*Tabla1[[#This Row],[Ancho ]])","v":{"v":0.08129015999999999,"d":"0.0813"}},{"$f":"IF(Tabla1[[#This Row],[Profundidad]]>Tabla1[[#This Row],[Profundidad de trabajo ]],\"Conforme\",\"No conforme\")","v":"Conforme"},{"$f":"Tabla1[[#This Row],[Densidad ]]*Tabla1[[#This Row],[Producción por ciclo ]]","v":{"v":8926.960210559999,"d":"8926.96"}},{"v":0.1,"d":"0.10"},{"$f":"Tabla1[[#This Row],[Peso ]]+Tabla1[[#This Row],[Peso de material]]","v":{"v":34981.96021056,"d":"34981.96"}},{"$f":"(Tabla1[[#This Row],[Factor de tracción ]]*Tabla1[[#This Row],[Carga total]])/1000","v":{"v":31.483764189504,"d":"31.48"}},{"v":2.3,"d":"2.30"},2.62,{"$f":"Tabla1[[#This Row],[dmin]]/(Tabla1[[#This Row],[Velod. Avance]]*1000/60)","v":{"v":0.5217391304347826,"d":"0.52"}},{"$f":"Tabla1[[#This Row],[dmin]]/(Tabla1[[#This Row],[Velod. Retroceso]]*1000/60)","v":{"v":0.45801526717557256,"d":"0.46"}},{"$f":"Tabla1[[#This Row],[Power shift]]+Tabla1[[#This Row],[T. Avance]]+Tabla1[[#This Row],[T. Retroceso]]","v":{"v":1.0797543976103552,"d":"1.08"}},0.69,{"$f":"(Tabla1[[#This Row],[Producción por ciclo ]]*60*Tabla1[[#This Row],[Eficiencia]])/Tabla1[[#This Row],[Cm]]","v":{"v":231.2689045337074,"d":"231.27"}}]
["D7E",{"v":26055,"d":"26055.00"},"Semi universal",{"v":6.17,"d":"6.170"},{"v":3.71,"d":"3.710"},1.524,0.555,"Arcilla húmeda",{"v":1660,"d":"1660.00"},"Empuje facil",{"$f":"IF(Tabla1[[#This Row],[Nivel de empuje]]=\"Empuje facil\",1.1,IF(Tabla1[[#This Row],[Nivel de empuje]]=\"Empuje promedio\",0.9,IF(Tabla1[[#This Row],[Nivel de empuje]]=\"Empuje medio dificultoso\",0.7,IF(Tabla1[[#This Row],[Nivel de empuje]]=\"Empuje dificultoso\",0.6,\" \"))))","v":{"v":1.1,"d":"1.10"}},{"v":0.7,"d":"0.70"},{"$f":"Tabla1[[#This Row],[Ancho ]]*(Tabla1[[#This Row],[Altura ]]^2)*Tabla1[[#This Row],[Factor Hoja]]","v":{"v":9.478432656,"d":"9.478"}},{"$f":"Tabla1[[#This Row],[Producción por ciclo ]]/(Tabla1[[#This Row],[Profundidad]]*Tabla1[[#This Row],[Ancho ]])","v":{"v":4.603303783783784,"d":"4.60"}},{"$f":"MROUND(3*Tabla1[[#This Row],[Longitud ]],10)","v":{"v":20,"d":"20.00"}},{"$f":"Tabla1[[#This Row],[Producción por ciclo ]]/(Tabla1[[#This Row],[dmin]]*Tabla1[[#This Row],[Ancho ]])","v":{"v":0.12774168,"d":"0.1277"}},{"$f":"IF(Tabla1[[#This Row],[Profundidad]]>Tabla1[[#This Row],[Profundidad de trabajo ]],\"Conforme\",\"No conforme\")","v":"Conforme"},{"$f":"Tabla1[[#This Row],[Densidad ]]*Tabla1[[#This Row],[Producción por ciclo ]]","v":{"v":15734.19820896,"d":"15734.20"}},{"v":0.1,"d":"0.10"},{"$f":"Tabla1[[#This Row],[Peso ]]+Tabla1[[#This Row],[Peso de material]]","v":{"v":41789.19820896,"d":"41789.20"}},{"$f":"(Tabla1[[#This Row],[Factor de tracción ]]*Tabla1[[#This Row],[Carga total]])/1000","v":{"v":29.252438746272,"d":"29.25"}},{"v":3,"d":"3.00"},2.62,{"$f":"Tabla1[[#This Row],[dmin]]/(Tabla1[[#This Row],[Velod. Avance]]*1000/60)","v":{"v":0.4,"d":"0.40"}},{"$f":"Tabla1[[#This Row],[dmin]]/(Tabla1[[#This Row],[Velod. Retroceso]]*1000/60)","v":{"v":0.45801526717557256,"d":"0.46"}},{"$f":"Tabla1[[#This Row],[Power shift]]+Tabla1[[#This Row],[T. Avance]]+Tabla1[[#This Row],[T. Retroceso]]","v":{"v":0.9580152671755726,"d":"0.96"}},0.69,{"$f":"(Tabla1[[#This Row],[Producción por ciclo ]]*60*Tabla1[[#This Row],[Eficiencia]])/Tabla1[[#This Row],[Cm]]","v":{"v":409.6042363868558,"d":"409.60"}}]
["D7E",{"v":26055,"d":"26055.00"},"Semi universal",{"v":6.17,"d":"6.170"},{"v":3.71,"d":"3.710"},1.524,0.555,"Arena seca ",{"v":1420,"d":"1420.00"},"Empuje facil",{"$f":"IF(Tabla1[[#This Row],[Nivel de empuje]]=\"Empuje facil\",1.1,IF(Tabla1[[#This Row],[Nivel de empuje]]=\"Empuje promedio\",0.9,IF(Tabla1[[#This Row],[Nivel de empuje]]=\"Empuje medio dificultoso\",0.7,IF(Tabla1[[#This Row],[Nivel de empuje]]=\"Empuje dificultoso\",0.6,\" \"))))","v":{"v":1.1,"d":"1.10"}},0.39,{"$f":"Tabla1[[#This Row],[Ancho ]]*(Tabla1[[#This Row],[Altura ]]^2)*Tabla1[[#This Row],[Factor Hoja]]","v":{"v":9.478432656,"d":"9.478"}},{"$f":"Tabla1[[#This Row],[Producción por ciclo ]]/(Tabla1[[#This Row],[Profundidad]]*Tabla1[[#This Row],[Ancho ]])","v":{"v":4.603303783783784,"d":"4.60"}},{"$f":"MROUND(3*Tabla1[[#This Row],[Longitud ]],10)","v":{"v":20,"d":"20.00"}},{"$f":"Tabla1[[#This Row],[Producción por ciclo ]]/(Tabla1[[#This Row],[dmin]]*Tabla1[[#This Row],[Ancho ]])","v":{"v":0.12774168,"d":"0.1277"}},{"$f":"IF(Tabla1[[#This Row],[Profundidad]]>Tabla1[[#This Row],[Profundidad de trabajo ]],\"Conforme\",\"No conforme\")","v":"Conforme"},{"$f":"Tabla1[[#This Row],[Densidad ]]*Tabla1[[#This Row],[Producción por ciclo ]]","v":{"v":13459.374371520002,"d":"13459.37"}},{"v":0.1,"d":"0.10"},{"$f":"Tabla1[[#This Row],[Peso ]]+Tabla1[[#This Row],[Peso de material]]","v":{"v":39514.37437152,"d":"39514.37"}},{"$f":"(Tabla1[[#This Row],[Factor de tracción ]]*Tabla1[[#This Row],[Carga total]])/1000","v":{"v":15.4106060048928,"d":"15.41"}},{"v":1.2,"d":"1.20"},2.62,{"$f":"Tabla1[[#This Row],[dmin]]/(Tabla1[[#This Row],[Velod. Avance]]*1000/60)","v":{"v":1,"d":"1.00"}},{"$f":"Tabla1[[#This Row],[dmin]]/(Tabla1[[#This Row],[Velod. Retroceso]]*1000/60)","v":{"v":0.45801526717557256,"d":"0.46"}},{"$f":"Tabla1[[#This Row],[Power shift]]+Tabla1[[#This Row],[T. Avance]]+Tabla1[[#This Row],[T. Retroceso]]","v":{"v":1.5580152671755727,"d":"1.56"}},0.69,{"$f":"(Tabla1[[#This Row],[Producción por ciclo ]]*60*Tabla1[[#This Row],[Eficiencia]])/Tabla1[[#This Row],[Cm]]","v":{"v":251.86345745492602,"d":"251.86"}}]
["D7E",{"v":26055,"d":"26055.00"},"Semi universal",{"v":6.17,"d":"6.170"},{"v":3.71,"d":"3.710"},1.524,0.555,"Arena húmeda ",{"v":1690,"d":"1690.00"},"Empuje medio dificultoso",{"$f":"IF(Tabla1[[#This Row],[Nivel de empuje]]=\"Empuje facil\",1.1,IF(Tabla1[[#This Row],[Nivel de empuje]]=\"Empuje promedio\",0.9,IF(Tabla1[[#This Row],[Nivel de empuje]]=\"Empuje medio dificultoso\",0.7,IF(Tabla1[[#This Row],[Nivel de empuje]]=\"Empuje dificultoso\",0.6,\" \"))))","v":{"v":0.7,"d":"0.70"}},{"v":0.5,"d":"0.50"},{"$f":"Tabla1[[#This Row],[Ancho ]]*(Tabla1[[#This Row],[Altura ]]^2)*Tabla1[[#This Row],[Factor Hoja]]","v":{"v":6.031729872,"d":"6.032"}},{"$f":"Tabla1[[#This Row],[Producción por ciclo ]]/(Tabla1[[#This Row],[Profundidad]]*Tabla1[[#This Row],[Ancho ]])","v":{"v":2.929375135135135,"d":"2.93"}},{"$f":"MROUND(3*Tabla1[[#This Row],[Longitud ]],10)","v":{"v":20,"d":"20.00"}},{"$f":"Tabla1[[#This Row],[Producción por ciclo ]]/(Tabla1[[#This Row],[dmin]]*Tabla1[[#This Row],[Ancho ]])","v":{"v":0.08129015999999999,"d":"0.0813"}},{"$f":"IF(Tabla1[[#This Row],[Profundidad]]>Tabla1[[#This Row],[Profundidad de trabajo ]],\"Conforme\",\"No conforme\")","v":"Conforme"},{"$f":"Tabla1[[#This Row],[Densidad ]]*Tabla1[[#This Row],[Producción por ciclo ]]","v":{"v":10193.62348368,"d":"10193.62"}},{"v":0.1,"d":"0.10"},{"$f":"Tabla1[[#This Row],[Peso ]]+Tabla1[[#This Row],[Peso de material]]","v":{"v":36248.62348368,"d":"36248.62"}},{"$f":"(Tabla1[[#This Row],[Factor de tracción ]]*Tabla1[[#This Row],[Carga total]])/1000","v":{"v":18.12431174184,"d":"18.12"}},1.35,2.62,{"$f":"Tabla1[[#This Row],[dmin]]/(Tabla1[[#This Row],[Velod. Avance]]*1000/60)","v":{"v":0.8888888888888888,"d":"0.89"}},{"$f":"Tabla1[[#This Row],[dmin]]/(Tabla1[[#This Row],[Velod. Retroceso]]*1000/60)","v":{"v":0.45801526717557256,"d":"0.46"}},{"$f":"Tabla1[[#This Row],[Power shift]]+Tabla1[[#This Row],[T. Avance]]+Tabla1[[#This Row],[T. Retroceso]]","v":{"v":1.4469041560644613,"d":"1.45"}},0.69,{"$f":"(Tabla1[[#This Row],[Producción por ciclo ]]*60*Tabla1[[#This Row],[Eficiencia]])/Tabla1[[#This Row],[Cm]]","v":{"v":172.58476703806974,"d":"172.58"}}]
["D7E",{"v":26055,"d":"26055.00"},"Semi universal",{"v":6.17,"d":"6.170"},{"v":3.71,"d":"3.710"},1.524,0.555,"Grava suelta ",{"v":1930,"d":"1930.00"},"Empuje promedio",{"$f":"IF(Tabla1[[#This Row],[Nivel de empuje]]=\"Empuje facil\",1.1,IF(Tabla1[[#This Row],[Nivel de empuje]]=\"Empuje promedio\",0.9,IF(Tabla1[[#This Row],[Nivel de empuje]]=\"Empuje medio dificultoso\",0.7,IF(Tabla1[[#This Row],[Nivel de empuje]]=\"Empuje dificultoso\",0.6,\" \"))))","v":{"v":0.9,"d":"0.90"}},{"v":0.5,"d":"0.50"},{"$f":"Tabla1[[#This Row],[Ancho ]]*(Tabla1[[#This Row],[Altura ]]^2)*Tabla1[[#This Row],[Factor Hoja]]","v":{"v":7.755081264,"d":"7.755"}},{"$f":"Tabla1[[#This Row],[Producción por ciclo ]]/(Tabla1[[#This Row],[Profundidad]]*Tabla1[[#This Row],[Ancho ]])","v":{"v":3.7663394594594592,"d":"3.77"}},{"$f":"MROUND(3*Tabla1[[#This Row],[Longitud ]],10)","v":{"v":20,"d":"20.00"}},{"$f":"Tabla1[[#This Row],[Producción por ciclo ]]/(Tabla1[[#This Row],[dmin]]*Tabla1[[#This Row],[Ancho ]])","v":{"v":0.10451592,"d":"0.1045"}},{"$f":"IF(Tabla1[[#This Row],[Profundidad]]>Tabla1[[#This Row],[Profundidad de trabajo ]],\"Conforme\",\"No conforme\")","v":"Conforme"},{"$f":"Tabla1[[#This Row],[Densidad ]]*Tabla1[[#This Row],[Producción por ciclo ]]","v":{"v":14967.30683952,"d":"14967.31"}},{"v":0.1,"d":"0.10"},{"$f":"Tabla1[[#This Row],[Peso ]]+Tabla1[[#This Row],[Peso de material]]","v":{"v":41022.30683952,"d":"41022.31"}},{"$f":"(Tabla1[[#This Row],[Factor de tracción ]]*Tabla1[[#This Row],[Carga total]])/1000","v":{"v":20.511153419760003,"d":"20.51"}},{"v":3.1,"d":"3.10"},2.62,{"$f":"Tabla1[[#This Row],[dmin]]/(Tabla1[[#This Row],[Velod. Avance]]*1000/60)","v":{"v":0.38709677419354843,"d":"0.39"}},{"$f":"Tabla1[[#This Row],[dmin]]/(Tabla1[[#This Row],[Velod. Retroceso]]*1000/60)","v":{"v":0.45801526717557256,"d":"0.46"}},{"$f":"Tabla1[[#This Row],[Power shift]]+Tabla1[[#This Row],[T. Avance]]+Tabla1[[#This Row],[T. Retroceso]]","v":{"v":0.945112041369121,"d":"0.95"}},0.69,{"$f":"(Tabla1[[#This Row],[Producción por ciclo ]]*60*Tabla1[[#This Row],[Eficiencia]])/Tabla1[[#This Row],[Cm]]","v":{"v":339.70614094018015,"d":"339.71"}}]
["D7E",{"v":26055,"d":"26055.00"},"Semi universal",{"v":6.17,"d":"6.170"},{"v":3.71,"d":"3.710"},1.524,0.555,"Nieve compacta",{"v":130,"d":"130.00"},"Empuje medio dificultoso",{"$f":"IF(Tabla1[[#This Row],[Nivel de empuje]]=\"Empuje facil\",1.1,IF(Tabla1[[#This Row],[Nivel de empuje]]=\"Empuje promedio\",0.9,IF(Tabla1[[#This Row],[Nivel de empuje]]=\"Empuje medio dificultoso\",0.7,IF(Tabla1[[#This Row],[Nivel de empuje]]=\"Empuje dificultoso\",0.6,\" \"))))","v":{"v":0.7,"d":"0.70"}},0.27,{"$f":"Tabla1[[#This Row],[Ancho ]]*(Tabla1[[#This Row],[Altura ]]^2)*Tabla1[[#This Row],[Factor Hoja]]","v":{"v":6.031729872,"d":"6.032"}},{"$f":"Tabla1[[#This Row],[Producción por ciclo ]]/(Tabla1[[#This Row],[Profundidad]]*Tabla1[[#This Row],[Ancho ]])","v":{"v":2.929375135135135,"d":"2.93"}},{"$f":"MROUND(3*Tabla1[[#This Row],[Longitud ]],10)","v":{"v":20,"d":"20.00"}},{"$f":"Tabla1[[#This Row],[Producción por ciclo ]]/(Tabla1[[#This Row],[dmin]]*Tabla1[[#This Row],[Ancho ]])","v":{"v":0.08129015999999999,"d":"0.0813"}},{"$f":"IF(Tabla1[[#This Row],[Profundidad]]>Tabla1[[#This Row],[Profundidad de trabajo ]],\"Conforme\",\"No conforme\")","v":"Conforme"},{"$f":"Tabla1[[#This Row],[Densidad ]]*Tabla1[[#This Row],[Producción por ciclo ]]","v":{"v":784.12488336,"d":"784.12"}},{"v":0.1,"d":"0.10"},{"$f":"Tabla1[[#This Row],[Peso ]]+Tabla1[[#This Row],[Peso de material]]","v":{"v":26839.12488336,"d":"26839.12"}},{"$f":"(Tabla1[[#This Row],[Factor de tracción ]]*Tabla1[[#This Row],[Carga total]])/1000","v":{"v":7.246563718507201,"d":"7.25"}},{"v":2.6,"d":"2.60"},2.62,{"$f":"Tabla1[[#This Row],[dmin]]/(Tabla1[[#This Row],[Velod. Avance]]*1000/60)","v":{"v":0.4615384615384615,"d":"0.46"}},{"$f":"Tabla1[[#This Row],[dmin]]/(Tabla1[[#This Row],[Velod. Retroceso]]*1000/60)","v":{"v":0.45801526717557256,"d":"0.46"}},{"$f":"Tabla1[[#This Row],[Power shift]]+Tabla1[[#This Row],[T. Avance]]+Tabla1[[#This Row],[T. Retroceso]]","v":{"v":1.0195537287140342,"d":"1.02"}},0.69,{"$f":"(Tabla1[[#This Row],[Producción por ciclo ]]*60*Tabla1[[#This Row],[Eficiencia]])/Tabla1[[#This Row],[Cm]]","v":{"v":244.92443082500853,"d":"244.92"}}]
["D7E",{"v":26055,"d":"26055.00"},"Semi universal",{"v":6.17,"d":"6.170"},{"v":3.71,"d":"3.710"},1.524,0.555,"Hielo ",{"v":520,"d":"520.00"},"Empuje dificultoso",{"$f":"IF(Tabla1[[#This Row],[Nivel de empuje]]=\"Empuje facil\",1.1,IF(Tabla1[[#This Row],[Nivel de empuje]]=\"Empuje promedio\",0.9,IF(Tabla1[[#This Row],[Nivel de empuje]]=\"Empuje medio dificultoso\",0.7,IF(Tabla1[[#This Row],[Nivel de empuje]]=\"Empuje dificultoso\",0.6,\" \"))))","v":{"v":0.6,"d":"0.60"}},0.12,{"$f":"Tabla1[[#This Row],[Ancho ]]*(Tabla1[[#This Row],[Altura ]]^2)*Tabla1[[#This Row],[Factor Hoja]]","v":{"v":5.170054176,"d":"5.170"}},{"$f":"Tabla1[[#This Row],[Producción por ciclo ]]/(Tabla1[[#This Row],[Profundidad]]*Tabla1[[#This Row],[Ancho ]])","v":{"v":2.510892972972973,"d":"2.51"}},{"$f":"MROUND(3*Tabla1[[#This Row],[Longitud ]],10)","v":{"v":20,"d":"20.00"}},{"$f":"Tabla1[[#This Row],[Producción por ciclo ]]/(Tabla1[[#This Row],[dmin]]*Tabla1[[#This Row],[Ancho ]])","v":{"v":0.06967728,"d":"0.0697"}},{"$f":"IF(Tabla1[[#This Row],[Profundidad]]>Tabla1[[#This Row],[Profundidad de trabajo ]],\"Conforme\",\"No conforme\")","v":"Conforme"},{"$f":"Tabla1[[#This Row],[Densidad ]]*Tabla1[[#This Row],[Producción por ciclo ]]","v":{"v":2688.42817152,"d":"2688.43"}},{"v":0.1,"d":"0.10"},{"$f":"Tabla1[[#This Row],[Peso ]]+Tabla1[[#This Row],[Peso de material]]","v":{"v":28743.42817152,"d":"28743.43"}},{"$f":"(Tabla1[[#This Row],[Factor de tracción ]]*Tabla1[[#This Row],[Carga total]])/1000","v":{"v":3.4492113805824003,"d":"3.45"}},{"v":2.2,"d":"2.20"},2.62,{"$f":"Tabla1[[#This Row],[dmin]]/(Tabla1[[#This Row],[Velod. Avance]]*1000/60)","v":{"v":0.5454545454545455,"d":"0.55"}},{"$f":"Tabla1[[#This Row],[dmin]]/(Tabla1[[#This Row],[Velod. Retroceso]]*1000/60)","v":{"v":0.45801526717557256,"d":"0.46"}},{"$f":"Tabla1[[#This Row],[Power shift]]+Tabla1[[#This Row],[T. Avance]]+Tabla1[[#This Row],[T. Retroceso]]","v":{"v":1.1034698126301181,"d":"1.10"}},0.69,{"$f":"(Tabla1[[#This Row],[Producción por ciclo ]]*60*Tabla1[[#This Row],[Eficiencia]])/Tabla1[[#This Row],[Cm]]","v":{"v":193.9701842647018,"d":"193.97"}}]
["D7E",{"v":26055,"d":"26055.00"},"Semi universal",{"v":6.17,"d":"6.170"},{"v":3.71,"d":"3.710"},1.524,0.555,"Tierra firme ",{"v":1510,"d":"1510.00"},"Empuje facil",{"$f":"IF(Tabla1[[#This Row],[Nivel de empuje]]=\"Empuje facil\",1.1,IF(Tabla1[[#This Row],[Nivel de empuje]]=\"Empuje promedio\",0.9,IF(Tabla1[[#This Row],[Nivel de empuje]]=\"Empuje medio dificultoso\",0.7,IF(Tabla1[[#This Row],[Nivel de empuje]]=\"Empuje dificultoso\",0.6,\" \"))))","v":{"v":1.1,"d":"1.10"}},{"v":0.9,"d":"0.90"},{"$f":"Tabla1[[#This Row],[Ancho ]]*(Tabla1[[#This Row],[Altura ]]^2)*Tabla1[[#This Row],[Factor Hoja]]","v":{"v":9.478432656,"d":"9.478"}},{"$f":"Tabla1[[#This Row],[Producción por ciclo ]]/(Tabla1[[#This Row],[Profundidad]]*Tabla1[[#This Row],[Ancho ]])","v":{"v":4.603303783783784,"d":"4.60"}},{"$f":"MROUND(3*Tabla1[[#This Row],[Longitud ]],10)","v":{"v":20,"d":"20.00"}},{"$f":"Tabla1[[#This Row],[Producción por ciclo ]]/(Tabla1[[#This Row],[dmin]]*Tabla1[[#This Row],[Ancho ]])","v":{"v":0.12774168,"d":"0.1277"}},{"$f":"IF(Tabla1[[#This Row],[Profundidad]]>Tabla1[[#This Row],[Profundidad de trabajo ]],\"Conforme\",\"No conforme\")","v":"Conforme"},{"$f":"Tabla1[[#This Row],[Densidad ]]*Tabla1[[#This Row],[Producción por ciclo ]]","v":{"v":14312.433310560002,"d":"14312.43"}},{"v":0.1,"d":"0.10"},{"$f":"Tabla1[[#This Row],[Peso ]]+Tabla1[[#This Row],[Peso de material]]","v":{"v":40367.43331056,"d":"40367.43"}},{"$f":"(Tabla1[[#This Row],[Factor de tracción ]]*Tabla1[[#This Row],[Carga total]])/1000","v":{"v":36.330689979504,"d":"36.33"}},{"v":3.3,"d":"3.30"},2.62,{"$f":"Tabla1[[#This Row],[dmin]]/(Tabla1[[#This Row],[Velod. Avance]]*1000/60)","v":{"v":0.36363636363636365,"d":"0.36"}},{"$f":"Tabla1[[#This Row],[dmin]]/(Tabla1[[#This Row],[Velod. Retroceso]]*1000/60)","v":{"v":0.45801526717557256,"d":"0.46"}},{"$f":"Tabla1[[#This Row],[Power shift]]+Tabla1[[#This Row],[T. Avance]]+Tabla1[[#This Row],[T. Retroceso]]","v":{"v":0.9216516308119362,"d":"0.92"}},0.69,{"$f":"(Tabla1[[#This Row],[Producción por ciclo ]]*60*Tabla1[[#This Row],[Eficiencia]])/Tabla1[[#This Row],[Cm]]","v":{"v":425.7651143227576,"d":"425.77"}}]
["D7E",{"v":26055,"d":"26055.00"},"Semi universal",{"v":6.17,"d":"6.170"},{"v":3.71,"d":"3.710"},1.524,0.555,"Tierra suelta ",{"v":1250,"d":"1250.00"},"Empuje facil",{"$f":"IF(Tabla1[[#This Row],[Nivel de empuje]]=\"Empuje facil\",1.1,IF(Tabla1[[#This Row],[Nivel de empuje]]=\"Empuje promedio\",0.9,IF(Tabla1[[#This Row],[Nivel de empuje]]=\"Empuje medio dificultoso\",0.7,IF(Tabla1[[#This Row],[Nivel de empuje]]=\"Empuje dificultoso\",0.6,\" \"))))","v":{"v":1.1,"d":"1.10"}},{"v":0.6,"d":"0.60"},{"$f":"Tabla1[[#This Row],[Ancho ]]*(Tabla1[[#This Row],[Altura ]]^2)*Tabla1[[#This Row],[Factor Hoja]]","v":{"v":9.478432656,"d":"9.478"}},{"$f":"Tabla1[[#This Row],[Producción por ciclo ]]/(Tabla1[[#This Row],[Profundidad]]*Tabla1[[#This Row],[Ancho ]])","v":{"v":4.603303783783784,"d":"4.60"}},{"$f":"MROUND(3*Tabla1[[#This Row],[Longitud ]],10)","v":{"v":20,"d":"20.00"}},{"$f":"Tabla1[[#This Row],[Producción por ciclo ]]/(Tabla1[[#This Row],[dmin]]*Tabla1[[#This Row],[Ancho ]])","v":{"v":0.12774168,"d":"0.1277"}},{"$f":"IF(Tabla1[[#This Row],[Profundidad]]>Tabla1[[#This Row],[Profundidad de trabajo ]],\"Conforme\",\"No conforme\")","v":"Conforme"},{"$f":"Tabla1[[#This Row],[Densidad ]]*Tabla1[[#This Row],[Producción por ciclo ]]","v":{"v":11848.04082,"d":"11848.04"}},{"v":0.1,"d":"0.10"},{"$f":"Tabla1[[#This Row],[Peso ]]+Tabla1[[#This Row],[Peso de material]]","v":{"v":37903.04082,"d":"37903.04"}},{"$f":"(Tabla1[[#This Row],[Factor de tracción ]]*Tabla1[[#This Row],[Carga total]])/1000","v":{"v":22.741824492,"d":"22.74"}},{"v":10.9,"d":"10.90"},2.62,{"$f":"Tabla1[[#This Row],[dmin]]/(Tabla1[[#This Row],[Velod. Avance]]*1000/60)","v":{"v":0.11009174311926606,"d":"0.11"}},{"$f":"Tabla1[[#This Row],[dmin]]/(Tabla1[[#This Row],[Velod. Retroceso]]*1000/60)","v":{"v":0.45801526717557256,"d":"0.46"}},{"$f":"Tabla1[[#This Row],[Power shift]]+Tabla1[[#This Row],[T. Avance]]+Tabla1[[#This Row],[T. Retroceso]]","v":{"v":0.6681070102948387,"d":"0.67"}},0.69,{"$f":"(Tabla1[[#This Row],[Producción por ciclo ]]*60*Tabla1[[#This Row],[Eficiencia]])/Tabla1[[#This Row],[Cm]]","v":{"v":587.3417071095078,"d":"587.34"}}]
["D7E",{"v":26055,"d":"26055.00"},"Semi universal",{"v":6.17,"d":"6.170"},{"v":3.71,"d":"3.710"},1.524,0.555,"Carbón ",{"v":1190,"d":"1190.00"},"Empuje promedio",{"$f":"IF(Tabla1[[#This Row],[Nivel de empuje]]=\"Empuje facil\",1.1,IF(Tabla1[[#This Row],[Nivel de empuje]]=\"Empuje promedio\",0.9,IF(Tabla1[[#This Row],[Nivel de empuje]]=\"Empuje medio dificultoso\",0.7,IF(Tabla1[[#This Row],[Nivel de empuje]]=\"Empuje dificultoso\",0.6,\" \"))))","v":{"v":0.9,"d":"0.90"}},{"v":0.6,"d":"0.60"},{"$f":"Tabla1[[#This Row],[Ancho ]]*(Tabla1[[#This Row],[Altura ]]^2)*Tabla1[[#This Row],[Factor Hoja]]","v":{"v":7.755081264,"d":"7.755"}},{"$f":"Tabla1[[#This Row],[Producción por ciclo ]]/(Tabla1[[#This Row],[Profundidad]]*Tabla1[[#This Row],[Ancho ]])","v":{"v":3.7663394594594592,"d":"3.77"}},{"$f":"MROUND(3*Tabla1[[#This Row],[Longitud ]],10)","v":{"v":20,"d":"20.00"}},{"$f":"Tabla1[[#This Row],[Producción por ciclo ]]/(Tabla1[[#This Row],[dmin]]*Tabla1[[#This Row],[Ancho ]])","v":{"v":0.10451592,"d":"0.1045"}},{"$f":"IF(Tabla1[[#This Row],[Profundidad]]>Tabla1[[#This Row],[Profundidad de trabajo ]],\"Conforme\",\"No conforme\")","v":"Conforme"},{"$f":"Tabla1[[#This Row],[Densidad ]]*Tabla1[[#This Row],[Producción por ciclo ]]","v":{"v":9228.54670416,"d":"9228.55"}},{"$f":"2*0.05","v":{"v":0.1,"d":"0.10"}},{"$f":"Tabla1[[#This Row],[Peso ]]+Tabla1[[#This Row],[Peso de material]]","v":{"v":35283.54670416,"d":"35283.55"}},{"$f":"(Tabla1[[#This Row],[Factor de tracción ]]*Tabla1[[#This Row],[Carga total]])/1000","v":{"v":21.170128022495998,"d":"21.17"}},{"v":1,"d":"1.00"},2.62,{"$f":"Tabla1[[#This Row],[dmin]]/(Tabla1[[#This Row],[Velod. Avance]]*1000/60)","v":{"v":1.2,"d":"1.20"}},{"$f":"Tabla1[[#This Row],[dmin]]/(Tabla1[[#This Row],[Velod. Retroceso]]*1000/60)","v":{"v":0.45801526717557256,"d":"0.46"}},{"$f":"Tabla1[[#This Row],[Power shift]]+Tabla1[[#This Row],[T. Avance]]+Tabla1[[#This Row],[T. Retroceso]]","v":{"v":1.7580152671755727,"d":"1.76"}},0.69,{"$f":"(Tabla1[[#This Row],[Producción por ciclo ]]*60*Tabla1[[#This Row],[Eficiencia]])/Tabla1[[#This Row],[Cm]]","v":{"v":182.62660758652885,"d":"182.63"}}]
["D7E",{"v":26055,"d":"26055.00"},"Universal ",{"v":6.38,"d":"6.380"},{"v":4.02,"d":"4.020"},{"v":1.55,"d":"1.550"},0.555,"Concreto ",{"v":2400,"d":"2400.00"},"Empuje dificultoso",{"$f":"IF(Tabla1[[#This Row],[Nivel de empuje]]=\"Empuje facil\",1.1,IF(Tabla1[[#This Row],[Nivel de empuje]]=\"Empuje promedio\",0.9,IF(Tabla1[[#This Row],[Nivel de empuje]]=\"Empuje medio dificultoso\",0.7,IF(Tabla1[[#This Row],[Nivel de empuje]]=\"Empuje dificultoso\",0.6,\" \"))))","v":{"v":0.6,"d":"0.60"}},0.45,{"$f":"Tabla1[[#This Row],[Ancho ]]*(Tabla1[[#This Row],[Altura ]]^2)*Tabla1[[#This Row],[Factor Hoja]]","v":{"v":5.794829999999999,"d":"5.795"}},{"$f":"Tabla1[[#This Row],[Producción por ciclo ]]/(Tabla1[[#This Row],[Profundidad]]*Tabla1[[#This Row],[Ancho ]])","v":{"v":2.5972972972972967,"d":"2.60"}},{"$f":"MROUND(3*Tabla1[[#This Row],[Longitud ]],10)","v":{"v":20,"d":"20.00"}},{"$f":"Tabla1[[#This Row],[Producción por ciclo ]]/(Tabla1[[#This Row],[dmin]]*Tabla1[[#This Row],[Ancho ]])","v":{"v":0.072075,"d":"0.0721"}},{"$f":"IF(Tabla1[[#This Row],[Profundidad]]>Tabla1[[#This Row],[Profundidad de trabajo ]],\"Conforme\",\"No conforme\")","v":"Conforme"},{"$f":"Tabla1[[#This Row],[Densidad ]]*Tabla1[[#This Row],[Producción por ciclo ]]","v":{"v":13907.591999999999,"d":"13907.59"}},{"v":0.1,"d":"0.10"},{"$f":"Tabla1[[#This Row],[Peso ]]+Tabla1[[#This Row],[Peso de material]]","v":{"v":39962.592,"d":"39962.59"}},{"$f":"(Tabla1[[#This Row],[Factor de tracción ]]*Tabla1[[#This Row],[Carga total]])/1000","v":{"v":17.983166399999998,"d":"17.98"}},{"v":2.2,"d":"2.20"},2.62,{"$f":"Tabla1[[#This Row],[dmin]]/(Tabla1[[#This Row],[Velod. Avance]]*1000/60)","v":{"v":0.5454545454545455,"d":"0.55"}},{"$f":"Tabla1[[#This Row],[dmin]]/(Tabla1[[#This Row],[Velod. Retroceso]]*1000/60)","v":{"v":0.45801526717557256,"d":"0.46"}},{"$f":"Tabla1[[#This Row],[Power shift]]+Tabla1[[#This Row],[T. Avance]]+Tabla1[[#This Row],[T. Retroceso]]","v":{"v":1.1034698126301181,"d":"1.10"}},0.69,{"$f":"(Tabla1[[#This Row],[Producción por ciclo ]]*60*Tabla1[[#This Row],[Eficiencia]])/Tabla1[[#This Row],[Cm]]","v":{"v":217.41053470976658,"d":"217.41"}}]
["D7E",{"v":26055,"d":"26055.00"},"Universal ",{"v":6.38,"d":"6.380"},{"v":4.02,"d":"4.020"},{"v":1.55,"d":"1.550"},0.555,"Arcilla seca ",{"v":1480,"d":"1480.00"},"Empuje medio dificultoso",{"$f":"IF(Tabla1[[#This Row],[Nivel de empuje]]=\"Empuje facil\",1.1,IF(Tabla1[[#This Row],[Nivel de empuje]]=\"Empuje promedio\",0.9,IF(Tabla1[[#This Row],[Nivel de empuje]]=\"Empuje medio dificultoso\",0.7,IF(Tabla1[[#This Row],[Nivel de empuje]]=\"Empuje dificultoso\",0.6,\" \"))))","v":{"v":0.7,"d":"0.70"}},{"v":0.9,"d":"0.90"},{"$f":"Tabla1[[#This Row],[Ancho ]]*(Tabla1[[#This Row],[Altura ]]^2)*Tabla1[[#This Row],[Factor Hoja]]","v":{"v":6.760634999999999,"d":"6.761"}},{"$f":"Tabla1[[#This Row],[Producción por ciclo ]]/(Tabla1[[#This Row],[Profundidad]]*Tabla1[[#This Row],[Ancho ]])","v":{"v":3.0301801801801798,"d":"3.03"}},{"$f":"MROUND(3*Tabla1[[#This Row],[Longitud ]],10)","v":{"v":20,"d":"20.00"}},{"$f":"Tabla1[[#This Row],[Producción por ciclo ]]/(Tabla1[[#This Row],[dmin]]*Tabla1[[#This Row],[Ancho ]])","v":{"v":0.0840875,"d":"0.0841"}},{"$f":"IF(Tabla1[[#This Row],[Profundidad]]>Tabla1[[#This Row],[Profundidad de trabajo ]],\"Conforme\",\"No conforme\")","v":"Conforme"},{"$f":"Tabla1[[#This Row],[Densidad ]]*Tabla1[[#This Row],[Producción por ciclo ]]","v":{"v":10005.739799999998,"d":"10005.74"}},{"v":0.1,"d":"0.10"},{"$f":"Tabla1[[#This Row],[Peso ]]+Tabla1[[#This Row],[Peso de material]]","v":{"v":36060.739799999996,"d":"36060.74"}},{"$f":"(Tabla1[[#This Row],[Factor de tracción ]]*Tabla1[[#This Row],[Carga total]])/1000","v":{"v":32.454665819999995,"d":"32.45"}},{"v":2.4,"d":"2.40"},2.62,{"$f":"Tabla1[[#This Row],[dmin]]/(Tabla1[[#This Row],[Velod. Avance]]*1000/60)","v":{"v":0.5,"d":"0.50"}},{"$f":"Tabla1[[#This Row],[dmin]]/(Tabla1[[#This Row],[Velod. Retroceso]]*1000/60)","v":{"v":0.45801526717557256,"d":"0.46"}},{"$f":"Tabla1[[#This Row],[Power shift]]+Tabla1[[#This Row],[T. Avance]]+Tabla1[[#This Row],[T. Retroceso]]","v":{"v":1.0580152671755725,"d":"1.06"}},0.69,{"$f":"(Tabla1[[#This Row],[Producción por ciclo ]]*60*Tabla1[[#This Row],[Eficiencia]])/Tabla1[[#This Row],[Cm]]","v":{"v":264.5427695454545,"d":"264.54"}}]
["D7E",{"v":26055,"d":"26055.00"},"Universal ",{"v":6.38,"d":"6.380"},{"v":4.02,"d":"4.020"},{"v":1.55,"d":"1.550"},0.555,"Arcilla húmeda",{"v":1660,"d":"1660.00"},"Empuje facil",{"$f":"IF(Tabla1[[#This Row],[Nivel de empuje]]=\"Empuje facil\",1.1,IF(Tabla1[[#This Row],[Nivel de empuje]]=\"Empuje promedio\",0.9,IF(Tabla1[[#This Row],[Nivel de empuje]]=\"Empuje medio dificultoso\",0.7,IF(Tabla1[[#This Row],[Nivel de empuje]]=\"Empuje dificultoso\",0.6,\" \"))))","v":{"v":1.1,"d":"1.10"}},{"v":0.7,"d":"0.70"},{"$f":"Tabla1[[#This Row],[Ancho ]]*(Tabla1[[#This Row],[Altura ]]^2)*Tabla1[[#This Row],[Factor Hoja]]","v":{"v":10.623855,"d":"10.624"}},{"$f":"Tabla1[[#This Row],[Producción por ciclo ]]/(Tabla1[[#This Row],[Profundidad]]*Tabla1[[#This Row],[Ancho ]])","v":{"v":4.761711711711712,"d":"4.76"}},{"$f":"MROUND(3*Tabla1[[#This Row],[Longitud ]],10)","v":{"v":20,"d":"20.00"}},{"$f":"Tabla1[[#This Row],[Producción por ciclo ]]/(Tabla1[[#This Row],[dmin]]*Tabla1[[#This Row],[Ancho ]])","v":{"v":0.13213750000000002,"d":"0.1321"}},{"$f":"IF(Tabla1[[#This Row],[Profundidad]]>Tabla1[[#This Row],[Profundidad de trabajo ]],\"Conforme\",\"No conforme\")","v":"Conforme"},{"$f":"Tabla1[[#This Row],[Densidad ]]*Tabla1[[#This Row],[Producción por ciclo ]]","v":{"v":17635.5993,"d":"17635.60"}},{"v":0.1,"d":"0.10"},{"$f":"Tabla1[[#This Row],[Peso ]]+Tabla1[[#This Row],[Peso de material]]","v":{"v":43690.5993,"d":"43690.60"}},{"$f":"(Tabla1[[#This Row],[Factor de tracción ]]*Tabla1[[#This Row],[Carga total]])/1000","v":{"v":30.58341951,"d":"30.58"}},{"v":3.2,"d":"3.20"},2.62,{"$f":"Tabla1[[#This Row],[dmin]]/(Tabla1[[#This Row],[Velod. Avance]]*1000/60)","v":{"v":0.375,"d":"0.38"}},{"$f":"Tabla1[[#This Row],[dmin]]/(Tabla1[[#This Row],[Velod. Retroceso]]*1000/60)","v":{"v":0.45801526717557256,"d":"0.46"}},{"$f":"Tabla1[[#This Row],[Power shift]]+Tabla1[[#This Row],[T. Avance]]+Tabla1[[#This Row],[T. Retroceso]]","v":{"v":0.9330152671755725,"d":"0.93"}},0.69,{"$f":"(Tabla1[[#This Row],[Producción por ciclo ]]*60*Tabla1[[#This Row],[Eficiencia]])/Tabla1[[#This Row],[Cm]]","v":{"v":471.4045015913275,"d":"471.40"}}]
["D7E",{"v":26055,"d":"26055.00"},"Universal ",{"v":6.38,"d":"6.380"},{"v":4.02,"d":"4.020"},{"v":1.55,"d":"1.550"},0.555,"Arena seca ",{"v":1420,"d":"1420.00"},"Empuje facil",{"$f":"IF(Tabla1[[#This Row],[Nivel de empuje]]=\"Empuje facil\",1.1,IF(Tabla1[[#This Row],[Nivel de empuje]]=\"Empuje promedio\",0.9,IF(Tabla1[[#This Row],[Nivel de empuje]]=\"Empuje medio dificultoso\",0.7,IF(Tabla1[[#This Row],[Nivel de empuje]]=\"Empuje dificultoso\",0.6,\" \"))))","v":{"v":1.1,"d":"1.10"}},0.39,{"$f":"Tabla1[[#This Row],[Ancho ]]*(Tabla1[[#This Row],[Altura ]]^2)*Tabla1[[#This Row],[Factor Hoja]]","v":{"v":10.623855,"d":"10.624"}},{"$f":"Tabla1[[#This Row],[Producción por ciclo ]]/(Tabla1[[#This Row],[Profundidad]]*Tabla1[[#This Row],[Ancho ]])","v":{"v":4.761711711711712,"d":"4.76"}},{"$f":"MROUND(3*Tabla1[[#This Row],[Longitud ]],10)","v":{"v":20,"d":"20.00"}},{"$f":"Tabla1[[#This Row],[Producción por ciclo ]]/(Tabla1[[#This Row],[dmin]]*Tabla1[[#This Row],[Ancho ]])","v":{"v":0.13213750000000002,"d":"0.1321"}},{"$f":"IF(Tabla1[[#This Row],[Profundidad]]>Tabla1[[#This Row],[Profundidad de trabajo ]],\"Conforme\",\"No conforme\")","v":"Conforme"},{"$f":"Tabla1[[#This Row],[Densidad ]]*Tabla1[[#This Row],[Producción por ciclo ]]","v":{"v":15085.8741,"d":"15085.87"}},{"v":0.1,"d":"0.10"},{"$f":"Tabla1[[#This Row],[Peso ]]+Tabla1[[#This Row],[Peso de material]]","v":{"v":41140.8741,"d":"41140.87"}},{"$f":"(Tabla1[[#This Row],[Factor de tracción ]]*Tabla1[[#This Row],[Carga total]])/1000","v":{"v":16.044940899,"d":"16.04"}},{"v":1.2,"d":"1.20"},2.62,{"$f":"Tabla1[[#This Row],[dmin]]/(Tabla1[[#This Row],[Velod. Avance]]*1000/60)","v":{"v":1,"d":"1.00"}},{"$f":"Tabla1[[#This Row],[dmin]]/(Tabla1[[#This Row],[Velod. Retroceso]]*1000/60)","v":{"v":0.45801526717557256,"d":"0.46"}},{"$f":"Tabla1[[#This Row],[Power shift]]+Tabla1[[#This Row],[T. Avance]]+Tabla1[[#This Row],[T. Retroceso]]","v":{"v":1.5580152671755727,"d":"1.56"}},0.69,{"$f":"(Tabla1[[#This Row],[Producción por ciclo ]]*60*Tabla1[[#This Row],[Eficiencia]])/Tabla1[[#This Row],[Cm]]","v":{"v":282.29992752082313,"d":"282.30"}}]
["D7E",{"v":26055,"d":"26055.00"},"Universal ",{"v":6.38,"d":"6.380"},{"v":4.02,"d":"4.020"},{"v":1.55,"d":"1.550"},0.555,"Arena húmeda ",{"v":1690,"d":"1690.00"},"Empuje medio dificultoso",{"$f":"IF(Tabla1[[#This Row],[Nivel de empuje]]=\"Empuje facil\",1.1,IF(Tabla1[[#This Row],[Nivel de empuje]]=\"Empuje promedio\",0.9,IF(Tabla1[[#This Row],[Nivel de empuje]]=\"Empuje medio dificultoso\",0.7,IF(Tabla1[[#This Row],[Nivel de empuje]]=\"Empuje dificultoso\",0.6,\" \"))))","v":{"v":0.7,"d":"0.70"}},{"v":0.5,"d":"0.50"},{"$f":"Tabla1[[#This Row],[Ancho ]]*(Tabla1[[#This Row],[Altura ]]^2)*Tabla1[[#This Row],[Factor Hoja]]","v":{"v":6.760634999999999,"d":"6.761"}},{"$f":"Tabla1[[#This Row],[Producción por ciclo ]]/(Tabla1[[#This Row],[Profundidad]]*Tabla1[[#This Row],[Ancho ]])","v":{"v":3.0301801801801798,"d":"3.03"}},{"$f":"MROUND(3*Tabla1[[#This Row],[Longitud ]],10)","v":{"v":20,"d":"20.00"}},{"$f":"Tabla1[[#This Row],[Producción por ciclo ]]/(Tabla1[[#This Row],[dmin]]*Tabla1[[#This Row],[Ancho ]])","v":{"v":0.0840875,"d":"0.0841"}},{"$f":"IF(Tabla1[[#This Row],[Profundidad]]>Tabla1[[#This Row],[Profundidad de trabajo ]],\"Conforme\",\"No conforme\")","v":"Conforme"},{"$f":"Tabla1[[#This Row],[Densidad ]]*Tabla1[[#This Row],[Producción por ciclo ]]","v":{"v":11425.473149999998,"d":"11425.47"}},{"v":0.1,"d":"0.10"},{"$f":"Tabla1[[#This Row],[Peso ]]+Tabla1[[#This Row],[Peso de material]]","v":{"v":37480.47315,"d":"37480.47"}},{"$f":"(Tabla1[[#This Row],[Factor de tracción ]]*Tabla1[[#This Row],[Carga total]])/1000","v":{"v":18.740236574999997,"d":"18.74"}},{"v":1.4,"d":"1.40"},2.62,{"$f":"Tabla1[[#This Row],[dmin]]/(Tabla1[[#This Row],[Velod. Avance]]*1000/60)","v":{"v":0.8571428571428572,"d":"0.86"}},{"$f":"Tabla1[[#This Row],[dmin]]/(Tabla1[[#This Row],[Velod. Retroceso]]*1000/60)","v":{"v":0.45801526717557256,"d":"0.46"}},{"$f":"Tabla1[[#This Row],[Power shift]]+Tabla1[[#This Row],[T. Avance]]+Tabla1[[#This Row],[T. Retroceso]]","v":{"v":1.4151581243184297,"d":"1.42"}},0.69,{"$f":"(Tabla1[[#This Row],[Producción por ciclo ]]*60*Tabla1[[#This Row],[Eficiencia]])/Tabla1[[#This Row],[Cm]]","v":{"v":197.78022271172068,"d":"197.78"}}]
["D7E",{"v":26055,"d":"26055.00"},"Universal ",{"v":6.38,"d":"6.380"},{"v":4.02,"d":"4.020"},{"v":1.55,"d":"1.550"},0.555,"Grava suelta ",{"v":1930,"d":"1930.00"},"Empuje promedio",{"$f":"IF(Tabla1[[#This Row],[Nivel de empuje]]=\"Empuje facil\",1.1,IF(Tabla1[[#This Row],[Nivel de empuje]]=\"Empuje promedio\",0.9,IF(Tabla1[[#This Row],[Nivel de empuje]]=\"Empuje medio dificultoso\",0.7,IF(Tabla1[[#This Row],[Nivel de empuje]]=\"Empuje dificultoso\",0.6,\" \"))))","v":{"v":0.9,"d":"0.90"}},{"v":0.5,"d":"0.50"},{"$f":"Tabla1[[#This Row],[Ancho ]]*(Tabla1[[#This Row],[Altura ]]^2)*Tabla1[[#This Row],[Factor Hoja]]","v":{"v":8.692245,"d":"8.692"}},{"$f":"Tabla1[[#This Row],[Producción por ciclo ]]/(Tabla1[[#This Row],[Profundidad]]*Tabla1[[#This Row],[Ancho ]])","v":{"v":3.895945945945946,"d":"3.90"}},{"$f":"MROUND(3*Tabla1[[#This Row],[Longitud ]],10)","v":{"v":20,"d":"20.00"}},{"$f":"Tabla1[[#This Row],[Producción por ciclo ]]/(Tabla1[[#This Row],[dmin]]*Tabla1[[#This Row],[Ancho ]])","v":{"v":0.10811250000000001,"d":"0.1081"}},{"$f":"IF(Tabla1[[#This Row],[Profundidad]]>Tabla1[[#This Row],[Profundidad de trabajo ]],\"Conforme\",\"No conforme\")","v":"Conforme"},{"$f":"Tabla1[[#This Row],[Densidad ]]*Tabla1[[#This Row],[Producción por ciclo ]]","v":{"v":16776.03285,"d":"16776.03"}},{"v":0.1,"d":"0.10"},{"$f":"Tabla1[[#This Row],[Peso ]]+Tabla1[[#This Row],[Peso de material]]","v":{"v":42831.03285,"d":"42831.03"}},{"$f":"(Tabla1[[#This Row],[Factor de tracción ]]*Tabla1[[#This Row],[Carga total]])/1000","v":{"v":21.415516425,"d":"21.42"}},3.05,2.62,{"$f":"Tabla1[[#This Row],[dmin]]/(Tabla1[[#This Row],[Velod. Avance]]*1000/60)","v":{"v":0.39344262295081966,"d":"0.39"}},{"$f":"Tabla1[[#This Row],[dmin]]/(Tabla1[[#This Row],[Velod. Retroceso]]*1000/60)","v":{"v":0.45801526717557256,"d":"0.46"}},{"$f":"Tabla1[[#This Row],[Power shift]]+Tabla1[[#This Row],[T. Avance]]+Tabla1[[#This Row],[T. Retroceso]]","v":{"v":0.9514578901263921,"d":"0.95"}},0.69,{"$f":"(Tabla1[[#This Row],[Producción por ciclo ]]*60*Tabla1[[#This Row],[Eficiencia]])/Tabla1[[#This Row],[Cm]]","v":{"v":378.2184652987596,"d":"378.22"}}]
["D7E",{"v":26055,"d":"26055.00"},"Universal ",{"v":6.38,"d":"6.380"},{"v":4.02,"d":"4.020"},{"v":1.55,"d":"1.550"},0.555,"Nieve compacta",{"v":130,"d":"130.00"},"Empuje medio dificultoso",{"$f":"IF(Tabla1[[#This Row],[Nivel de empuje]]=\"Empuje facil\",1.1,IF(Tabla1[[#This Row],[Nivel de empuje]]=\"Empuje promedio\",0.9,IF(Tabla1[[#This Row],[Nivel de empuje]]=\"Empuje medio dificultoso\",0.7,IF(Tabla1[[#This Row],[Nivel de empuje]]=\"Empuje dificultoso\",0.6,\" \"))))","v":{"v":0.7,"d":"0.70"}},0.27,{"$f":"Tabla1[[#This Row],[Ancho ]]*(Tabla1[[#This Row],[Altura ]]^2)*Tabla1[[#This Row],[Factor Hoja]]","v":{"v":6.760634999999999,"d":"6.761"}},{"$f":"Tabla1[[#This Row],[Producción por ciclo ]]/(Tabla1[[#This Row],[Profundidad]]*Tabla1[[#This Row],[Ancho ]])","v":{"v":3.0301801801801798,"d":"3.03"}},{"$f":"MROUND(3*Tabla1[[#This Row],[Longitud ]],10)","v":{"v":20,"d":"20.00"}},{"$f":"Tabla1[[#This Row],[Producción por ciclo ]]/(Tabla1[[#This Row],[dmin]]*Tabla1[[#This Row],[Ancho ]])","v":{"v":0.0840875,"d":"0.0841"}},{"$f":"IF(Tabla1[[#This Row],[Profundidad]]>Tabla1[[#This Row],[Profundidad de trabajo ]],\"Conforme\",\"No conforme\")","v":"Conforme"},{"$f":"Tabla1[[#This Row],[Densidad ]]*Tabla1[[#This Row],[Producción por ciclo ]]","v":{"v":878.8825499999998,"d":"878.88"}},{"v":0.1,"d":"0.10"},{"$f":"Tabla1[[#This Row],[Peso ]]+Tabla1[[#This Row],[Peso de material]]","v":{"v":26933.88255,"d":"26933.88"}},{"$f":"(Tabla1[[#This Row],[Factor de tracción ]]*Tabla1[[#This Row],[Carga total]])/1000","v":{"v":7.2721482885,"d":"7.27"}},{"v":2.5,"d":"2.50"},2.62,{"$f":"Tabla1[[#This Row],[dmin]]/(Tabla1[[#This Row],[Velod. Avance]]*1000/60)","v":{"v":0.48000000000000004,"d":"0.48"}},{"$f":"Tabla1[[#This Row],[dmin]]/(Tabla1[[#This Row],[Velod. Retroceso]]*1000/60)","v":{"v":0.45801526717557256,"d":"0.46"}},{"$f":"Tabla1[[#This Row],[Power shift]]+Tabla1[[#This Row],[T. Avance]]+Tabla1[[#This Row],[T. Retroceso]]","v":{"v":1.0380152671755727,"d":"1.04"}},0.69,{"$f":"(Tabla1[[#This Row],[Producción por ciclo ]]*60*Tabla1[[#This Row],[Eficiencia]])/Tabla1[[#This Row],[Cm]]","v":{"v":269.6398577658478,"d":"269.64"}}]
["D7E",{"v":26055,"d":"26055.00"},"Universal ",{"v":6.38,"d":"6.380"},{"v":4.02,"d":"4.020"},{"v":1.55,"d":"1.550"},0.555,"Hielo ",{"v":520,"d":"520.00"},"Empuje dificultoso",{"$f":"IF(Tabla1[[#This Row],[Nivel de empuje]]=\"Empuje facil\",1.1,IF(Tabla1[[#This Row],[Nivel de empuje]]=\"Empuje promedio\",0.9,IF(Tabla1[[#This Row],[Nivel de empuje]]=\"Empuje medio dificultoso\",0.7,IF(Tabla1[[#This Row],[Nivel de empuje]]=\"Empuje dificultoso\",0.6,\" \"))))","v":{"v":0.6,"d":"0.60"}},0.12,{"$f":"Tabla1[[#This Row],[Ancho ]]*(Tabla1[[#This Row],[Altura ]]^2)*Tabla1[[#This Row],[Factor Hoja]]","v":{"v":5.794829999999999,"d":"5.795"}},{"$f":"Tabla1[[#This Row],[Producción por ciclo ]]/(Tabla1[[#This Row],[Profundidad]]*Tabla1[[#This Row],[Ancho ]])","v":{"v":2.5972972972972967,"d":"2.60"}},{"$f":"MROUND(3*Tabla1[[#This Row],[Longitud ]],10)","v":{"v":20,"d":"20.00"}},{"$f":"Tabla1[[#This Row],[Producción por ciclo ]]/(Tabla1[[#This Row],[dmin]]*Tabla1[[#This Row],[Ancho ]])","v":{"v":0.072075,"d":"0.0721"}},{"$f":"IF(Tabla1[[#This Row],[Profundidad]]>Tabla1[[#This Row],[Profundidad de trabajo ]],\"Conforme\",\"No conforme\")","v":"Conforme"},{"$f":"Tabla1[[#This Row],[Densidad ]]*Tabla1[[#This Row],[Producción por ciclo ]]","v":{"v":3013.3115999999995,"d":"3013.31"}},{"v":0.1,"d":"0.10"},{"$f":"Tabla1[[#This Row],[Peso ]]+Tabla1[[#This Row],[Peso de material]]","v":{"v":29068.3116,"d":"29068.31"}},{"$f":"(Tabla1[[#This Row],[Factor de tracción ]]*Tabla1[[#This Row],[Carga total]])/1000","v":{"v":3.488197392,"d":"3.49"}},{"v":2.2,"d":"2.20"},2.62,{"$f":"Tabla1[[#This Row],[dmin]]/(Tabla1[[#This Row],[Velod. Avance]]*1000/60)","v":{"v":0.5454545454545455,"d":"0.55"}},{"$f":"Tabla1[[#This Row],[dmin]]/(Tabla1[[#This Row],[Velod. Retroceso]]*1000/60)","v":{"v":0.45801526717557256,"d":"0.46"}},{"$f":"Tabla1[[#This Row],[Power shift]]+Tabla1[[#This Row],[T. Avance]]+Tabla1[[#This Row],[T. Retroceso]]","v":{"v":1.1034698126301181,"d":"1.10"}},0.69,{"$f":"(Tabla1[[#This Row],[Producción por ciclo ]]*60*Tabla1[[#This Row],[Eficiencia]])/Tabla1[[#This Row],[Cm]]","v":{"v":217.41053470976658,"d":"217.41"}}]
["D7E",{"v":26055,"d":"26055.00"},"Universal ",{"v":6.38,"d":"6.380"},{"v":4.02,"d":"4.020"},{"v":1.55,"d":"1.550"},0.555,"Tierra firme ",{"v":1510,"d":"1510.00"},"Empuje facil",{"$f":"IF(Tabla1[[#This Row],[Nivel de empuje]]=\"Empuje facil\",1.1,IF(Tabla1[[#This Row],[Nivel de empuje]]=\"Empuje promedio\",0.9,IF(Tabla1[[#This Row],[Nivel de empuje]]=\"Empuje medio dificultoso\",0.7,IF(Tabla1[[#This Row],[Nivel de empuje]]=\"Empuje dificultoso\",0.6,\" \"))))","v":{"v":1.1,"d":"1.10"}},{"v":0.9,"d":"0.90"},{"$f":"Tabla1[[#This Row],[Ancho ]]*(Tabla1[[#This Row],[Altura ]]^2)*Tabla1[[#This Row],[Factor Hoja]]","v":{"v":10.623855,"d":"10.624"}},{"$f":"Tabla1[[#This Row],[Producción por ciclo ]]/(Tabla1[[#This Row],[Profundidad]]*Tabla1[[#This Row],[Ancho ]])","v":{"v":4.761711711711712,"d":"4.76"}},{"$f":"MROUND(3*Tabla1[[#This Row],[Longitud ]],10)","v":{"v":20,"d":"20.00"}},{"$f":"Tabla1[[#This Row],[Producción por ciclo ]]/(Tabla1[[#This Row],[dmin]]*Tabla1[[#This Row],[Ancho ]])","v":{"v":0.13213750000000002,"d":"0.1321"}},{"$f":"IF(Tabla1[[#This Row],[Profundidad]]>Tabla1[[#This Row],[Profundidad de trabajo ]],\"Conforme\",\"No conforme\")","v":"Conforme"},{"$f":"Tabla1[[#This Row],[Densidad ]]*Tabla1[[#This Row],[Producción por ciclo ]]","v":{"v":16042.021050000001,"d":"16042.02"}},{"v":0.1,"d":"0.10"},{"$f":"Tabla1[[#This Row],[Peso ]]+Tabla1[[#This Row],[Peso de material]]","v":{"v":42097.02105,"d":"42097.02"}},{"$f":"(Tabla1[[#This Row],[Factor de tracción ]]*Tabla1[[#This Row],[Carga total]])/1000","v":{"v":37.887318945000004,"d":"37.89"}},{"v":7,"d":"7.00"},2.62,{"$f":"Tabla1[[#This Row],[dmin]]/(Tabla1[[#This Row],[Velod. Avance]]*1000/60)","v":{"v":0.17142857142857143,"d":"0.17"}},{"$f":"Tabla1[[#This Row],[dmin]]/(Tabla1[[#This Row],[Velod. Retroceso]]*1000/60)","v":{"v":0.45801526717557256,"d":"0.46"}},{"$f":"Tabla1[[#This Row],[Power shift]]+Tabla1[[#This Row],[T. Avance]]+Tabla1[[#This Row],[T. Retroceso]]","v":{"v":0.729443838604144,"d":"0.73"}},0.69,{"$f":"(Tabla1[[#This Row],[Producción por ciclo ]]*60*Tabla1[[#This Row],[Eficiencia]])/Tabla1[[#This Row],[Cm]]","v":{"v":602.9629338451189,"d":"602.96"}}]
["D7E",{"v":26055,"d":"26055.00"},"Universal ",{"v":6.38,"d":"6.380"},{"v":4.02,"d":"4.020"},{"v":1.55,"d":"1.550"},0.555,"Tierra suelta ",{"v":1250,"d":"1250.00"},"Empuje facil",{"$f":"IF(Tabla1[[#This Row],[Nivel de empuje]]=\"Empuje facil\",1.1,IF(Tabla1[[#This Row],[Nivel de empuje]]=\"Empuje promedio\",0.9,IF(Tabla1[[#This Row],[Nivel de empuje]]=\"Empuje medio dificultoso\",0.7,IF(Tabla1[[#This Row],[Nivel de empuje]]=\"Empuje dificultoso\",0.6,\" \"))))","v":{"v":1.1,"d":"1.10"}},{"v":0.6,"d":"0.60"},{"$f":"Tabla1[[#This Row],[Ancho ]]*(Tabla1[[#This Row],[Altura ]]^2)*Tabla1[[#This Row],[Factor Hoja]]","v":{"v":10.623855,"d":"10.624"}},{"$f":"Tabla1[[#This Row],[Producción por ciclo ]]/(Tabla1[[#This Row],[Profundidad]]*Tabla1[[#This Row],[Ancho ]])","v":{"v":4.761711711711712,"d":"4.76"}},{"$f":"MROUND(3*Tabla1[[#This Row],[Longitud ]],10)","v":{"v":20,"d":"20.00"}},{"$f":"Tabla1[[#This Row],[Producción por ciclo ]]/(Tabla1[[#This Row],[dmin]]*Tabla1[[#This Row],[Ancho ]])","v":{"v":0.13213750000000002,"d":"0.1321"}},{"$f":"IF(Tabla1[[#This Row],[Profundidad]]>Tabla1[[#This Row],[Profundidad de trabajo ]],\"Conforme\",\"No conforme\")","v":"Conforme"},{"$f":"Tabla1[[#This Row],[Densidad ]]*Tabla1[[#This Row],[Producción por ciclo ]]","v":{"v":13279.81875,"d":"13279.82"}},{"v":0.1,"d":"0.10"},{"$f":"Tabla1[[#This Row],[Peso ]]+Tabla1[[#This Row],[Peso de material]]","v":{"v":39334.81875,"d":"39334.82"}},{"$f":"(Tabla1[[#This Row],[Factor de tracción ]]*Tabla1[[#This Row],[Carga total]])/1000","v":{"v":23.600891249999997,"d":"23.60"}},{"v":10.8,"d":"10.80"},2.62,{"$f":"Tabla1[[#This Row],[dmin]]/(Tabla1[[#This Row],[Velod. Avance]]*1000/60)","v":{"v":0.1111111111111111,"d":"0.11"}},{"$f":"Tabla1[[#This Row],[dmin]]/(Tabla1[[#This Row],[Velod. Retroceso]]*1000/60)","v":{"v":0.45801526717557256,"d":"0.46"}},{"$f":"Tabla1[[#This Row],[Power shift]]+Tabla1[[#This Row],[T. Avance]]+Tabla1[[#This Row],[T. Retroceso]]","v":{"v":0.6691263782866836,"d":"0.67"}},0.69,{"$f":"(Tabla1[[#This Row],[Producción por ciclo ]]*60*Tabla1[[#This Row],[Eficiencia]])/Tabla1[[#This Row],[Cm]]","v":{"v":657.3161831195335,"d":"657.32"}}]
["D7E",{"v":26055,"d":"26055.00"},"Universal ",{"v":6.38,"d":"6.380"},{"v":4.02,"d":"4.020"},{"v":1.55,"d":"1.550"},0.555,"Carbón ",{"v":1190,"d":"1190.00"},"Empuje promedio",{"$f":"IF(Tabla1[[#This Row],[Nivel de empuje]]=\"Empuje facil\",1.1,IF(Tabla1[[#This Row],[Nivel de empuje]]=\"Empuje promedio\",0.9,IF(Tabla1[[#This Row],[Nivel de empuje]]=\"Empuje medio dificultoso\",0.7,IF(Tabla1[[#This Row],[Nivel de empuje]]=\"Empuje dificultoso\",0.6,\" \"))))","v":{"v":0.9,"d":"0.90"}},{"v":0.6,"d":"0.60"},{"$f":"Tabla1[[#This Row],[Ancho ]]*(Tabla1[[#This Row],[Altura ]]^2)*Tabla1[[#This Row],[Factor Hoja]]","v":{"v":8.692245,"d":"8.692"}},{"$f":"Tabla1[[#This Row],[Producción por ciclo ]]/(Tabla1[[#This Row],[Profundidad]]*Tabla1[[#This Row],[Ancho ]])","v":{"v":3.895945945945946,"d":"3.90"}},{"$f":"MROUND(3*Tabla1[[#This Row],[Longitud ]],10)","v":{"v":20,"d":"20.00"}},{"$f":"Tabla1[[#This Row],[Producción por ciclo ]]/(Tabla1[[#This Row],[dmin]]*Tabla1[[#This Row],[Ancho ]])","v":{"v":0.10811250000000001,"d":"0.1081"}},{"$f":"IF(Tabla1[[#This Row],[Profundidad]]>Tabla1[[#This Row],[Profundidad de trabajo ]],\"Conforme\",\"No conforme\")","v":"Conforme"},{"$f":"Tabla1[[#This Row],[Densidad ]]*Tabla1[[#This Row],[Producción por ciclo ]]","v":{"v":10343.77155,"d":"10343.77"}},{"v":0.1,"d":"0.10"},{"$f":"Tabla1[[#This Row],[Peso ]]+Tabla1[[#This Row],[Peso de material]]","v":{"v":36398.77155,"d":"36398.77"}},{"$f":"(Tabla1[[#This Row],[Factor de tracción ]]*Tabla1[[#This Row],[Carga total]])/1000","v":{"v":21.839262929999997,"d":"21.84"}},1.45,2.62,{"$f":"Tabla1[[#This Row],[dmin]]/(Tabla1[[#This Row],[Velod. Avance]]*1000/60)","v":{"v":0.8275862068965517,"d":"0.83"}},{"$f":"Tabla1[[#This Row],[dmin]]/(Tabla1[[#This Row],[Velod. Retroceso]]*1000/60)","v":{"v":0.45801526717557256,"d":"0.46"}},{"$f":"Tabla1[[#This Row],[Power shift]]+Tabla1[[#This Row],[T. Avance]]+Tabla1[[#This Row],[T. Retroceso]]","v":{"v":1.3856014740721243,"d":"1.39"}},0.69,{"$f":"(Tabla1[[#This Row],[Producción por ciclo ]]*60*Tabla1[[#This Row],[Eficiencia]])/Tabla1[[#This Row],[Cm]]","v":{"v":259.7131640906931,"d":"259.71"}}]
["D7R ",{"v":25455,"d":"25455.00"},"Semi universal ",{"v":6.03,"d":"6.030"},{"v":3.69,"d":"3.690"},1.524,0.527,"Concreto ",{"v":2400,"d":"2400.00"},"Empuje dificultoso",{"$f":"IF(Tabla1[[#This Row],[Nivel de empuje]]=\"Empuje facil\",1.1,IF(Tabla1[[#This Row],[Nivel de empuje]]=\"Empuje promedio\",0.9,IF(Tabla1[[#This Row],[Nivel de empuje]]=\"Empuje medio dificultoso\",0.7,IF(Tabla1[[#This Row],[Nivel de empuje]]=\"Empuje dificultoso\",0.6,\" \"))))","v":{"v":0.6,"d":"0.60"}},0.45,{"$f":"Tabla1[[#This Row],[Ancho ]]*(Tabla1[[#This Row],[Altura ]]^2)*Tabla1[[#This Row],[Factor Hoja]]","v":{"v":5.142183264,"d":"5.142"}},{"$f":"Tabla1[[#This Row],[Producción por ciclo ]]/(Tabla1[[#This Row],[Profundidad]]*Tabla1[[#This Row],[Ancho ]])","v":{"v":2.6442990512333964,"d":"2.64"}},{"$f":"MROUND(3*Tabla1[[#This Row],[Longitud ]],10)","v":{"v":20,"d":"20.00"}},{"$f":"Tabla1[[#This Row],[Producción por ciclo ]]/(Tabla1[[#This Row],[dmin]]*Tabla1[[#This Row],[Ancho ]])","v":{"v":0.06967728,"d":"0.0697"}},{"$f":"IF(Tabla1[[#This Row],[Profundidad]]>Tabla1[[#This Row],[Profundidad de trabajo ]],\"Conforme\",\"No conforme\")","v":"Conforme"},{"$f":"Tabla1[[#This Row],[Densidad ]]*Tabla1[[#This Row],[Producción por ciclo ]]","v":{"v":12341.239833599999,"d":"12341.24"}},{"v":0.1,"d":"0.10"},{"$f":"Tabla1[[#This Row],[Peso ]]+Tabla1[[#This Row],[Peso de material]]","v":{"v":37796.2398336,"d":"37796.24"}},{"$f":"(Tabla1[[#This Row],[Factor de tracción ]]*Tabla1[[#This Row],[Carga total]])/1000","v":{"v":17.00830792512,"d":"17.01"}},{"v":2.8,"d":"2.80"},1.99,{"$f":"Tabla1[[#This Row],[dmin]]/(Tabla1[[#This Row],[Velod. Avance]]*1000/60)","v":{"v":0.4285714285714286,"d":"0.43"}},{"$f":"Tabla1[[#This Row],[dmin]]/(Tabla1[[#This Row],[Velod. Retroceso]]*1000/60)","v":{"v":0.6030150753768845,"d":"0.60"}},{"$f":"Tabla1[[#This Row],[Power shift]]+Tabla1[[#This Row],[T. Avance]]+Tabla1[[#This Row],[T. Retroceso]]","v":{"v":1.131586503948313,"d":"1.13"}},0.69,{"$f":"(Tabla1[[#This Row],[Producción por ciclo ]]*60*Tabla1[[#This Row],[Eficiencia]])/Tabla1[[#This Row],[Cm]]","v":{"v":188.1308997472136,"d":"188.13"}}]
["D7R ",{"v":25455,"d":"25455.00"},"Semi universal ",{"v":6.03,"d":"6.030"},{"v":3.69,"d":"3.690"},1.524,0.527,"Arcilla seca ",{"v":1480,"d":"1480.00"},"Empuje medio dificultoso",{"$f":"IF(Tabla1[[#This Row],[Nivel de empuje]]=\"Empuje facil\",1.1,IF(Tabla1[[#This Row],[Nivel de empuje]]=\"Empuje promedio\",0.9,IF(Tabla1[[#This Row],[Nivel de empuje]]=\"Empuje medio dificultoso\",0.7,IF(Tabla1[[#This Row],[Nivel de empuje]]=\"Empuje dificultoso\",0.6,\" \"))))","v":{"v":0.7,"d":"0.70"}},{"v":0.9,"d":"0.90"},{"$f":"Tabla1[[#This Row],[Ancho ]]*(Tabla1[[#This Row],[Altura ]]^2)*Tabla1[[#This Row],[Factor Hoja]]","v":{"v":5.9992138079999995,"d":"5.999"}},{"$f":"Tabla1[[#This Row],[Producción por ciclo ]]/(Tabla1[[#This Row],[Profundidad]]*Tabla1[[#This Row],[Ancho ]])","v":{"v":3.0850155597722955,"d":"3.09"}},{"$f":"MROUND(3*Tabla1[[#This Row],[Longitud ]],10)","v":{"v":20,"d":"20.00"}},{"$f":"Tabla1[[#This Row],[Producción por ciclo ]]/(Tabla1[[#This Row],[dmin]]*Tabla1[[#This Row],[Ancho ]])","v":{"v":0.08129016,"d":"0.0813"}},{"$f":"IF(Tabla1[[#This Row],[Profundidad]]>Tabla1[[#This Row],[Profundidad de trabajo ]],\"Conforme\",\"No conforme\")","v":"Conforme"},{"$f":"Tabla1[[#This Row],[Densidad ]]*Tabla1[[#This Row],[Producción por ciclo ]]","v":{"v":8878.83643584,"d":"8878.84"}},{"v":0.1,"d":"0.10"},{"$f":"Tabla1[[#This Row],[Peso ]]+Tabla1[[#This Row],[Peso de material]]","v":{"v":34333.83643584,"d":"34333.84"}},{"$f":"(Tabla1[[#This Row],[Factor de tracción ]]*Tabla1[[#This Row],[Carga total]])/1000","v":{"v":30.900452792256,"d":"30.90"}},{"v":1.5,"d":"1.50"},1.99,{"$f":"Tabla1[[#This Row],[dmin]]/(Tabla1[[#This Row],[Velod. Avance]]*1000/60)","v":{"v":0.8,"d":"0.80"}},{"$f":"Tabla1[[#This Row],[dmin]]/(Tabla1[[#This Row],[Velod. Retroceso]]*1000/60)","v":{"v":0.6030150753768845,"d":"0.60"}},{"$f":"Tabla1[[#This Row],[Power shift]]+Tabla1[[#This Row],[T. Avance]]+Tabla1[[#This Row],[T. Retroceso]]","v":{"v":1.5030150753768845,"d":"1.50"}},0.69,{"$f":"(Tabla1[[#This Row],[Producción por ciclo ]]*60*Tabla1[[#This Row],[Eficiencia]])/Tabla1[[#This Row],[Cm]]","v":{"v":165.24614803941424,"d":"165.25"}}]
["D7R ",{"v":25455,"d":"25455.00"},"Semi universal ",{"v":6.03,"d":"6.030"},{"v":3.69,"d":"3.690"},1.524,0.527,"Arcilla húmeda",{"v":1660,"d":"1660.00"},"Empuje facil",{"$f":"IF(Tabla1[[#This Row],[Nivel de empuje]]=\"Empuje facil\",1.1,IF(Tabla1[[#This Row],[Nivel de empuje]]=\"Empuje promedio\",0.9,IF(Tabla1[[#This Row],[Nivel de empuje]]=\"Empuje medio dificultoso\",0.7,IF(Tabla1[[#This Row],[Nivel de empuje]]=\"Empuje dificultoso\",0.6,\" \"))))","v":{"v":1.1,"d":"1.10"}},{"v":0.7,"d":"0.70"},{"$f":"Tabla1[[#This Row],[Ancho ]]*(Tabla1[[#This Row],[Altura ]]^2)*Tabla1[[#This Row],[Factor Hoja]]","v":{"v":9.427335984,"d":"9.427"}},{"$f":"Tabla1[[#This Row],[Producción por ciclo ]]/(Tabla1[[#This Row],[Profundidad]]*Tabla1[[#This Row],[Ancho ]])","v":{"v":4.847881593927894,"d":"4.85"}},{"$f":"MROUND(3*Tabla1[[#This Row],[Longitud ]],10)","v":{"v":20,"d":"20.00"}},{"$f":"Tabla1[[#This Row],[Producción por ciclo ]]/(Tabla1[[#This Row],[dmin]]*Tabla1[[#This Row],[Ancho ]])","v":{"v":0.12774168000000002,"d":"0.1277"}},{"$f":"IF(Tabla1[[#This Row],[Profundidad]]>Tabla1[[#This Row],[Profundidad de trabajo ]],\"Conforme\",\"No conforme\")","v":"Conforme"},{"$f":"Tabla1[[#This Row],[Densidad ]]*Tabla1[[#This Row],[Producción por ciclo ]]","v":{"v":15649.377733440002,"d":"15649.38"}},{"v":0.1,"d":"0.10"},{"$f":"Tabla1[[#This Row],[Peso ]]+Tabla1[[#This Row],[Peso de material]]","v":{"v":41104.37773344,"d":"41104.38"}},{"$f":"(Tabla1[[#This Row],[Factor de tracción ]]*Tabla1[[#This Row],[Carga total]])/1000","v":{"v":28.773064413408,"d":"28.77"}},{"v":1.8,"d":"1.80"},1.99,{"$f":"Tabla1[[#This Row],[dmin]]/(Tabla1[[#This Row],[Velod. Avance]]*1000/60)","v":{"v":0.6666666666666666,"d":"0.67"}},{"$f":"Tabla1[[#This Row],[dmin]]/(Tabla1[[#This Row],[Velod. Retroceso]]*1000/60)","v":{"v":0.6030150753768845,"d":"0.60"}},{"$f":"Tabla1[[#This Row],[Power shift]]+Tabla1[[#This Row],[T. Avance]]+Tabla1[[#This Row],[T. Retroceso]]","v":{"v":1.369681742043551,"d":"1.37"}},0.69,{"$f":"(Tabla1[[#This Row],[Producción por ciclo ]]*60*Tabla1[[#This Row],[Eficiencia]])/Tabla1[[#This Row],[Cm]]","v":{"v":284.95065514656625,"d":"284.95"}}]
["D7R ",{"v":25455,"d":"25455.00"},"Semi universal ",{"v":6.03,"d":"6.030"},{"v":3.69,"d":"3.690"},1.524,0.527,"Arena seca ",{"v":1420,"d":"1420.00"},"Empuje facil",{"$f":"IF(Tabla1[[#This Row],[Nivel de empuje]]=\"Empuje facil\",1.1,IF(Tabla1[[#This Row],[Nivel de empuje]]=\"Empuje promedio\",0.9,IF(Tabla1[[#This Row],[Nivel de empuje]]=\"Empuje medio dificultoso\",0.7,IF(Tabla1[[#This Row],[Nivel de empuje]]=\"Empuje dificultoso\",0.6,\" \"))))","v":{"v":1.1,"d":"1.10"}},0.39,{"$f":"Tabla1[[#This Row],[Ancho ]]*(Tabla1[[#This Row],[Altura ]]^2)*Tabla1[[#This Row],[Factor Hoja]]","v":{"v":9.427335984,"d":"9.427"}},{"$f":"Tabla1[[#This Row],[Producción por ciclo ]]/(Tabla1[[#This Row],[Profundidad]]*Tabla1[[#This Row],[Ancho ]])","v":{"v":4.847881593927894,"d":"4.85"}},{"$f":"MROUND(3*Tabla1[[#This Row],[Longitud ]],10)","v":{"v":20,"d":"20.00"}},{"$f":"Tabla1[[#This Row],[Producción por ciclo ]]/(Tabla1[[#This Row],[dmin]]*Tabla1[[#This Row],[Ancho ]])","v":{"v":0.12774168000000002,"d":"0.1277"}},{"$f":"IF(Tabla1[[#This Row],[Profundidad]]>Tabla1[[#This Row],[Profundidad de trabajo ]],\"Conforme\",\"No conforme\")","v":"Conforme"},{"$f":"Tabla1[[#This Row],[Densidad ]]*Tabla1[[#This Row],[Producción por ciclo ]]","v":{"v":13386.817097280002,"d":"13386.82"}},{"v":0.1,"d":"0.10"},{"$f":"Tabla1[[#This Row],[Peso ]]+Tabla1[[#This Row],[Peso de material]]","v":{"v":38841.81709728,"d":"38841.82"}},{"$f":"(Tabla1[[#This Row],[Factor de tracción ]]*Tabla1[[#This Row],[Carga total]])/1000","v":{"v":15.1483086679392,"d":"15.15"}},{"v":3,"d":"3.00"},1.99,{"$f":"Tabla1[[#This Row],[dmin]]/(Tabla1[[#This Row],[Velod. Avance]]*1000/60)","v":{"v":0.4,"d":"0.40"}},{"$f":"Tabla1[[#This Row],[dmin]]/(Tabla1[[#This Row],[Velod. Retroceso]]*1000/60)","v":{"v":0.6030150753768845,"d":"0.60"}},{"$f":"Tabla1[[#This Row],[Power shift]]+Tabla1[[#This Row],[T. Avance]]+Tabla1[[#This Row],[T. Retroceso]]","v":{"v":1.1030150753768844,"d":"1.10"}},0.69,{"$f":"(Tabla1[[#This Row],[Producción por ciclo ]]*60*Tabla1[[#This Row],[Eficiencia]])/Tabla1[[#This Row],[Cm]]","v":{"v":353.8407755707627,"d":"353.84"}}]
["D7R ",{"v":25455,"d":"25455.00"},"Semi universal ",{"v":6.03,"d":"6.030"},{"v":3.69,"d":"3.690"},1.524,0.527,"Arena húmeda ",{"v":1690,"d":"1690.00"},"Empuje medio dificultoso",{"$f":"IF(Tabla1[[#This Row],[Nivel de empuje]]=\"Empuje facil\",1.1,IF(Tabla1[[#This Row],[Nivel de empuje]]=\"Empuje promedio\",0.9,IF(Tabla1[[#This Row],[Nivel de empuje]]=\"Empuje medio dificultoso\",0.7,IF(Tabla1[[#This Row],[Nivel de empuje]]=\"Empuje dificultoso\",0.6,\" \"))))","v":{"v":0.7,"d":"0.70"}},{"v":0.5,"d":"0.50"},{"$f":"Tabla1[[#This Row],[Ancho ]]*(Tabla1[[#This Row],[Altura ]]^2)*Tabla1[[#This Row],[Factor Hoja]]","v":{"v":5.9992138079999995,"d":"5.999"}},{"$f":"Tabla1[[#This Row],[Producción por ciclo ]]/(Tabla1[[#This Row],[Profundidad]]*Tabla1[[#This Row],[Ancho ]])","v":{"v":3.0850155597722955,"d":"3.09"}},{"$f":"MROUND(3*Tabla1[[#This Row],[Longitud ]],10)","v":{"v":20,"d":"20.00"}},{"$f":"Tabla1[[#This Row],[Producción por ciclo ]]/(Tabla1[[#This Row],[dmin]]*Tabla1[[#This Row],[Ancho ]])","v":{"v":0.08129016,"d":"0.0813"}},{"$f":"IF(Tabla1[[#This Row],[Profundidad]]>Tabla1[[#This Row],[Profundidad de trabajo ]],\"Conforme\",\"No conforme\")","v":"Conforme"},{"$f":"Tabla1[[#This Row],[Densidad ]]*Tabla1[[#This Row],[Producción por ciclo ]]","v":{"v":10138.671335519999,"d":"10138.67"}},{"v":0.1,"d":"0.10"},{"$f":"Tabla1[[#This Row],[Peso ]]+Tabla1[[#This Row],[Peso de material]]","v":{"v":35593.67133552,"d":"35593.67"}},{"$f":"(Tabla1[[#This Row],[Factor de tracción ]]*Tabla1[[#This Row],[Carga total]])/1000","v":{"v":17.79683566776,"d":"17.80"}},{"v":2.8,"d":"2.80"},1.99,{"$f":"Tabla1[[#This Row],[dmin]]/(Tabla1[[#This Row],[Velod. Avance]]*1000/60)","v":{"v":0.4285714285714286,"d":"0.43"}},{"$f":"Tabla1[[#This Row],[dmin]]/(Tabla1[[#This Row],[Velod. Retroceso]]*1000/60)","v":{"v":0.6030150753768845,"d":"0.60"}},{"$f":"Tabla1[[#This Row],[Power shift]]+Tabla1[[#This Row],[T. Avance]]+Tabla1[[#This Row],[T. Retroceso]]","v":{"v":1.131586503948313,"d":"1.13"}},0.69,{"$f":"(Tabla1[[#This Row],[Producción por ciclo ]]*60*Tabla1[[#This Row],[Eficiencia]])/Tabla1[[#This Row],[Cm]]","v":{"v":219.4860497050825,"d":"219.49"}}]
["D7R ",{"v":25455,"d":"25455.00"},"Semi universal ",{"v":6.03,"d":"6.030"},{"v":3.69,"d":"3.690"},1.524,0.527,"Grava suelta ",{"v":1930,"d":"1930.00"},"Empuje promedio",{"$f":"IF(Tabla1[[#This Row],[Nivel de empuje]]=\"Empuje facil\",1.1,IF(Tabla1[[#This Row],[Nivel de empuje]]=\"Empuje promedio\",0.9,IF(Tabla1[[#This Row],[Nivel de empuje]]=\"Empuje medio dificultoso\",0.7,IF(Tabla1[[#This Row],[Nivel de empuje]]=\"Empuje dificultoso\",0.6,\" \"))))","v":{"v":0.9,"d":"0.90"}},{"v":0.5,"d":"0.50"},{"$f":"Tabla1[[#This Row],[Ancho ]]*(Tabla1[[#This Row],[Altura ]]^2)*Tabla1[[#This Row],[Factor Hoja]]","v":{"v":7.713274896000001,"d":"7.713"}},{"$f":"Tabla1[[#This Row],[Producción por ciclo ]]/(Tabla1[[#This Row],[Profundidad]]*Tabla1[[#This Row],[Ancho ]])","v":{"v":3.966448576850095,"d":"3.97"}},{"$f":"MROUND(3*Tabla1[[#This Row],[Longitud ]],10)","v":{"v":20,"d":"20.00"}},{"$f":"Tabla1[[#This Row],[Producción por ciclo ]]/(Tabla1[[#This Row],[dmin]]*Tabla1[[#This Row],[Ancho ]])","v":{"v":0.10451592000000001,"d":"0.1045"}},{"$f":"IF(Tabla1[[#This Row],[Profundidad]]>Tabla1[[#This Row],[Profundidad de trabajo ]],\"Conforme\",\"No conforme\")","v":"Conforme"},{"$f":"Tabla1[[#This Row],[Densidad ]]*Tabla1[[#This Row],[Producción por ciclo ]]","v":{"v":14886.620549280002,"d":"14886.62"}},{"v":0.1,"d":"0.10"},{"$f":"Tabla1[[#This Row],[Peso ]]+Tabla1[[#This Row],[Peso de material]]","v":{"v":40341.62054928,"d":"40341.62"}},{"$f":"(Tabla1[[#This Row],[Factor de tracción ]]*Tabla1[[#This Row],[Carga total]])/1000","v":{"v":20.17081027464,"d":"20.17"}},{"v":2.3,"d":"2.30"},1.99,{"$f":"Tabla1[[#This Row],[dmin]]/(Tabla1[[#This Row],[Velod. Avance]]*1000/60)","v":{"v":0.5217391304347826,"d":"0.52"}},{"$f":"Tabla1[[#This Row],[dmin]]/(Tabla1[[#This Row],[Velod. Retroceso]]*1000/60)","v":{"v":0.6030150753768845,"d":"0.60"}},{"$f":"Tabla1[[#This Row],[Power shift]]+Tabla1[[#This Row],[T. Avance]]+Tabla1[[#This Row],[T. Retroceso]]","v":{"v":1.2247542058116672,"d":"1.22"}},0.69,{"$f":"(Tabla1[[#This Row],[Producción por ciclo ]]*60*Tabla1[[#This Row],[Eficiencia]])/Tabla1[[#This Row],[Cm]]","v":{"v":260.7295236702408,"d":"260.73"}}]
["D7R ",{"v":25455,"d":"25455.00"},"Semi universal ",{"v":6.03,"d":"6.030"},{"v":3.69,"d":"3.690"},1.524,0.527,"Nieve compacta",{"v":130,"d":"130.00"},"Empuje medio dificultoso",{"$f":"IF(Tabla1[[#This Row],[Nivel de empuje]]=\"Empuje facil\",1.1,IF(Tabla1[[#This Row],[Nivel de empuje]]=\"Empuje promedio\",0.9,IF(Tabla1[[#This Row],[Nivel de empuje]]=\"Empuje medio dificultoso\",0.7,IF(Tabla1[[#This Row],[Nivel de empuje]]=\"Empuje dificultoso\",0.6,\" \"))))","v":{"v":0.7,"d":"0.70"}},0.27,{"$f":"Tabla1[[#This Row],[Ancho ]]*(Tabla1[[#This Row],[Altura ]]^2)*Tabla1[[#This Row],[Factor Hoja]]","v":{"v":5.9992138079999995,"d":"5.999"}},{"$f":"Tabla1[[#This Row],[Producción por ciclo ]]/(Tabla1[[#This Row],[Profundidad]]*Tabla1[[#This Row],[Ancho ]])","v":{"v":3.0850155597722955,"d":"3.09"}},{"$f":"MROUND(3*Tabla1[[#This Row],[Longitud ]],10)","v":{"v":20,"d":"20.00"}},{"$f":"Tabla1[[#This Row],[Producción por ciclo ]]/(Tabla1[[#This Row],[dmin]]*Tabla1[[#This Row],[Ancho ]])","v":{"v":0.08129016,"d":"0.0813"}},{"$f":"IF(Tabla1[[#This Row],[Profundidad]]>Tabla1[[#This Row],[Profundidad de trabajo ]],\"Conforme\",\"No conforme\")","v":"Conforme"},{"$f":"Tabla1[[#This Row],[Densidad ]]*Tabla1[[#This Row],[Producción por ciclo ]]","v":{"v":779.8977950399999,"d":"779.90"}},{"v":0.1,"d":"0.10"},{"$f":"Tabla1[[#This Row],[Peso ]]+Tabla1[[#This Row],[Peso de material]]","v":{"v":26234.89779504,"d":"26234.90"}},{"$f":"(Tabla1[[#This Row],[Factor de tracción ]]*Tabla1[[#This Row],[Carga total]])/1000","v":{"v":7.0834224046608005,"d":"7.08"}},{"v":7,"d":"7.00"},1.99,{"$f":"Tabla1[[#This Row],[dmin]]/(Tabla1[[#This Row],[Velod. Avance]]*1000/60)","v":{"v":0.17142857142857143,"d":"0.17"}},{"$f":"Tabla1[[#This Row],[dmin]]/(Tabla1[[#This Row],[Velod. Retroceso]]*1000/60)","v":{"v":0.6030150753768845,"d":"0.60"}},{"$f":"Tabla1[[#This Row],[Power shift]]+Tabla1[[#This Row],[T. Avance]]+Tabla1[[#This Row],[T. Retroceso]]","v":{"v":0.8744436468054559,"d":"0.87"}},0.69,{"$f":"(Tabla1[[#This Row],[Producción por ciclo ]]*60*Tabla1[[#This Row],[Eficiencia]])/Tabla1[[#This Row],[Cm]]","v":{"v":284.02911103367666,"d":"284.03"}}]
["D7R ",{"v":25455,"d":"25455.00"},"Semi universal ",{"v":6.03,"d":"6.030"},{"v":3.69,"d":"3.690"},1.524,0.527,"Hielo ",{"v":520,"d":"520.00"},"Empuje dificultoso",{"$f":"IF(Tabla1[[#This Row],[Nivel de empuje]]=\"Empuje facil\",1.1,IF(Tabla1[[#This Row],[Nivel de empuje]]=\"Empuje promedio\",0.9,IF(Tabla1[[#This Row],[Nivel de empuje]]=\"Empuje medio dificultoso\",0.7,IF(Tabla1[[#This Row],[Nivel de empuje]]=\"Empuje dificultoso\",0.6,\" \"))))","v":{"v":0.6,"d":"0.60"}},0.12,{"$f":"Tabla1[[#This Row],[Ancho ]]*(Tabla1[[#This Row],[Altura ]]^2)*Tabla1[[#This Row],[Factor Hoja]]","v":{"v":5.142183264,"d":"5.142"}},{"$f":"Tabla1[[#This Row],[Producción por ciclo ]]/(Tabla1[[#This Row],[Profundidad]]*Tabla1[[#This Row],[Ancho ]])","v":{"v":2.6442990512333964,"d":"2.64"}},{"$f":"MROUND(3*Tabla1[[#This Row],[Longitud ]],10)","v":{"v":20,"d":"20.00"}},{"$f":"Tabla1[[#This Row],[Producción por ciclo ]]/(Tabla1[[#This Row],[dmin]]*Tabla1[[#This Row],[Ancho ]])","v":{"v":0.06967728,"d":"0.0697"}},{"$f":"IF(Tabla1[[#This Row],[Profundidad]]>Tabla1[[#This Row],[Profundidad de trabajo ]],\"Conforme\",\"No conforme\")","v":"Conforme"},{"$f":"Tabla1[[#This Row],[Densidad ]]*Tabla1[[#This Row],[Producción por ciclo ]]","v":{"v":2673.9352972799998,"d":"2673.94"}},{"v":0.1,"d":"0.10"},{"$f":"Tabla1[[#This Row],[Peso ]]+Tabla1[[#This Row],[Peso de material]]","v":{"v":28128.93529728,"d":"28128.94"}},{"$f":"(Tabla1[[#This Row],[Factor de tracción ]]*Tabla1[[#This Row],[Carga total]])/1000","v":{"v":3.3754722356736,"d":"3.38"}},{"v":9,"d":"9.00"},1.99,{"$f":"Tabla1[[#This Row],[dmin]]/(Tabla1[[#This Row],[Velod. Avance]]*1000/60)","v":{"v":0.13333333333333333,"d":"0.13"}},{"$f":"Tabla1[[#This Row],[dmin]]/(Tabla1[[#This Row],[Velod. Retroceso]]*1000/60)","v":{"v":0.6030150753768845,"d":"0.60"}},{"$f":"Tabla1[[#This Row],[Power shift]]+Tabla1[[#This Row],[T. Avance]]+Tabla1[[#This Row],[T. Retroceso]]","v":{"v":0.8363484087102178,"d":"0.84"}},0.69,{"$f":"(Tabla1[[#This Row],[Producción por ciclo ]]*60*Tabla1[[#This Row],[Eficiencia]])/Tabla1[[#This Row],[Cm]]","v":{"v":254.54270602117202,"d":"254.54"}}]
["D7R ",{"v":25455,"d":"25455.00"},"Semi universal ",{"v":6.03,"d":"6.030"},{"v":3.69,"d":"3.690"},1.524,0.527,"Tierra firme ",{"v":1510,"d":"1510.00"},"Empuje facil",{"$f":"IF(Tabla1[[#This Row],[Nivel de empuje]]=\"Empuje facil\",1.1,IF(Tabla1[[#This Row],[Nivel de empuje]]=\"Empuje promedio\",0.9,IF(Tabla1[[#This Row],[Nivel de empuje]]=\"Empuje medio dificultoso\",0.7,IF(Tabla1[[#This Row],[Nivel de empuje]]=\"Empuje dificultoso\",0.6,\" \"))))","v":{"v":1.1,"d":"1.10"}},{"v":0.9,"d":"0.90"},{"$f":"Tabla1[[#This Row],[Ancho ]]*(Tabla1[[#This Row],[Altura ]]^2)*Tabla1[[#This Row],[Factor Hoja]]","v":{"v":9.427335984,"d":"9.427"}},{"$f":"Tabla1[[#This Row],[Producción por ciclo ]]/(Tabla1[[#This Row],[Profundidad]]*Tabla1[[#This Row],[Ancho ]])","v":{"v":4.847881593927894,"d":"4.85"}},{"$f":"MROUND(3*Tabla1[[#This Row],[Longitud ]],10)","v":{"v":20,"d":"20.00"}},{"$f":"Tabla1[[#This Row],[Producción por ciclo ]]/(Tabla1[[#This Row],[dmin]]*Tabla1[[#This Row],[Ancho ]])","v":{"v":0.12774168000000002,"d":"0.1277"}},{"$f":"IF(Tabla1[[#This Row],[Profundidad]]>Tabla1[[#This Row],[Profundidad de trabajo ]],\"Conforme\",\"No conforme\")","v":"Conforme"},{"$f":"Tabla1[[#This Row],[Densidad ]]*Tabla1[[#This Row],[Producción por ciclo ]]","v":{"v":14235.27733584,"d":"14235.28"}},{"v":0.1,"d":"0.10"},{"$f":"Tabla1[[#This Row],[Peso ]]+Tabla1[[#This Row],[Peso de material]]","v":{"v":39690.27733584,"d":"39690.28"}},{"$f":"(Tabla1[[#This Row],[Factor de tracción ]]*Tabla1[[#This Row],[Carga total]])/1000","v":{"v":35.721249602256,"d":"35.72"}},{"v":1.1,"d":"1.10"},1.99,{"$f":"Tabla1[[#This Row],[dmin]]/(Tabla1[[#This Row],[Velod. Avance]]*1000/60)","v":{"v":1.090909090909091,"d":"1.09"}},{"$f":"Tabla1[[#This Row],[dmin]]/(Tabla1[[#This Row],[Velod. Retroceso]]*1000/60)","v":{"v":0.6030150753768845,"d":"0.60"}},{"$f":"Tabla1[[#This Row],[Power shift]]+Tabla1[[#This Row],[T. Avance]]+Tabla1[[#This Row],[T. Retroceso]]","v":{"v":1.7939241662859757,"d":"1.79"}},0.69,{"$f":"(Tabla1[[#This Row],[Producción por ciclo ]]*60*Tabla1[[#This Row],[Eficiencia]])/Tabla1[[#This Row],[Cm]]","v":{"v":217.56310387725844,"d":"217.56"}}]
["D7R ",{"v":25455,"d":"25455.00"},"Semi universal ",{"v":6.03,"d":"6.030"},{"v":3.69,"d":"3.690"},1.524,0.527,"Tierra suelta ",{"v":1250,"d":"1250.00"},"Empuje facil",{"$f":"IF(Tabla1[[#This Row],[Nivel de empuje]]=\"Empuje facil\",1.1,IF(Tabla1[[#This Row],[Nivel de empuje]]=\"Empuje promedio\",0.9,IF(Tabla1[[#This Row],[Nivel de empuje]]=\"Empuje medio dificultoso\",0.7,IF(Tabla1[[#This Row],[Nivel de empuje]]=\"Empuje dificultoso\",0.6,\" \"))))","v":{"v":1.1,"d":"1.10"}},{"v":0.6,"d":"0.60"},{"$f":"Tabla1[[#This Row],[Ancho ]]*(Tabla1[[#This Row],[Altura ]]^2)*Tabla1[[#This Row],[Factor Hoja]]","v":{"v":9.427335984,"d":"9.427"}},{"$f":"Tabla1[[#This Row],[Producción por ciclo ]]/(Tabla1[[#This Row],[Profundidad]]*Tabla1[[#This Row],[Ancho ]])","v":{"v":4.847881593927894,"d":"4.85"}},{"$f":"MROUND(3*Tabla1[[#This Row],[Longitud ]],10)","v":{"v":20,"d":"20.00"}},{"$f":"Tabla1[[#This Row],[Producción por ciclo ]]/(Tabla1[[#This Row],[dmin]]*Tabla1[[#This Row],[Ancho ]])","v":{"v":0.12774168000000002,"d":"0.1277"}},{"$f":"IF(Tabla1[[#This Row],[Profundidad]]>Tabla1[[#This Row],[Profundidad de trabajo ]],\"Conforme\",\"No conforme\")","v":"Conforme"},{"$f":"Tabla1[[#This Row],[Densidad ]]*Tabla1[[#This Row],[Producción por ciclo ]]","v":{"v":11784.16998,"d":"11784.17"}},{"v":0.1,"d":"0.10"},{"$f":"Tabla1[[#This Row],[Peso ]]+Tabla1[[#This Row],[Peso de material]]","v":{"v":37239.16998,"d":"37239.17"}},{"$f":"(Tabla1[[#This Row],[Factor de tracción ]]*Tabla1[[#This Row],[Carga total]])/1000","v":{"v":22.343501988,"d":"22.34"}},{"v":2.2,"d":"2.20"},1.99,{"$f":"Tabla1[[#This Row],[dmin]]/(Tabla1[[#This Row],[Velod. Avance]]*1000/60)","v":{"v":0.5454545454545455,"d":"0.55"}},{"$f":"Tabla1[[#This Row],[dmin]]/(Tabla1[[#This Row],[Velod. Retroceso]]*1000/60)","v":{"v":0.6030150753768845,"d":"0.60"}},{"$f":"Tabla1[[#This Row],[Power shift]]+Tabla1[[#This Row],[T. Avance]]+Tabla1[[#This Row],[T. Retroceso]]","v":{"v":1.2484696208314299,"d":"1.25"}},0.69,{"$f":"(Tabla1[[#This Row],[Producción por ciclo ]]*60*Tabla1[[#This Row],[Eficiencia]])/Tabla1[[#This Row],[Cm]]","v":{"v":312.6161047296302,"d":"312.62"}}]
["D7R ",{"v":25455,"d":"25455.00"},"Semi universal ",{"v":6.03,"d":"6.030"},{"v":3.69,"d":"3.690"},1.524,0.527,"Carbón ",{"v":1190,"d":"1190.00"},"Empuje promedio",{"$f":"IF(Tabla1[[#This Row],[Nivel de empuje]]=\"Empuje facil\",1.1,IF(Tabla1[[#This Row],[Nivel de empuje]]=\"Empuje promedio\",0.9,IF(Tabla1[[#This Row],[Nivel de empuje]]=\"Empuje medio dificultoso\",0.7,IF(Tabla1[[#This Row],[Nivel de empuje]]=\"Empuje dificultoso\",0.6,\" \"))))","v":{"v":0.9,"d":"0.90"}},{"v":0.6,"d":"0.60"},{"$f":"Tabla1[[#This Row],[Ancho ]]*(Tabla1[[#This Row],[Altura ]]^2)*Tabla1[[#This Row],[Factor Hoja]]","v":{"v":7.713274896000001,"d":"7.713"}},{"$f":"Tabla1[[#This Row],[Producción por ciclo ]]/(Tabla1[[#This Row],[Profundidad]]*Tabla1[[#This Row],[Ancho ]])","v":{"v":3.966448576850095,"d":"3.97"}},{"$f":"MROUND(3*Tabla1[[#This Row],[Longitud ]],10)","v":{"v":20,"d":"20.00"}},{"$f":"Tabla1[[#This Row],[Producción por ciclo ]]/(Tabla1[[#This Row],[dmin]]*Tabla1[[#This Row],[Ancho ]])","v":{"v":0.10451592000000001,"d":"0.1045"}},{"$f":"IF(Tabla1[[#This Row],[Profundidad]]>Tabla1[[#This Row],[Profundidad de trabajo ]],\"Conforme\",\"No conforme\")","v":"Conforme"},{"$f":"Tabla1[[#This Row],[Densidad ]]*Tabla1[[#This Row],[Producción por ciclo ]]","v":{"v":9178.79712624,"d":"9178.80"}},{"v":0.1,"d":"0.10"},{"$f":"Tabla1[[#This Row],[Peso ]]+Tabla1[[#This Row],[Peso de material]]","v":{"v":34633.79712624,"d":"34633.80"}},{"$f":"(Tabla1[[#This Row],[Factor de tracción ]]*Tabla1[[#This Row],[Carga total]])/1000","v":{"v":20.780278275744,"d":"20.78"}},2.35,1.99,{"$f":"Tabla1[[#This Row],[dmin]]/(Tabla1[[#This Row],[Velod. Avance]]*1000/60)","v":{"v":0.5106382978723405,"d":"0.51"}},{"$f":"Tabla1[[#This Row],[dmin]]/(Tabla1[[#This Row],[Velod. Retroceso]]*1000/60)","v":{"v":0.6030150753768845,"d":"0.60"}},{"$f":"Tabla1[[#This Row],[Power shift]]+Tabla1[[#This Row],[T. Avance]]+Tabla1[[#This Row],[T. Retroceso]]","v":{"v":1.213653373249225,"d":"1.21"}},0.69,{"$f":"(Tabla1[[#This Row],[Producción por ciclo ]]*60*Tabla1[[#This Row],[Eficiencia]])/Tabla1[[#This Row],[Cm]]","v":{"v":263.11431890926355,"d":"263.11"}}]
["D8R",{"v":37920,"d":"37920.00"},"Orientación",{"v":6.57,"d":"6.570"},{"v":5,"d":"5.000"},1.174,0.625,"Concreto ",{"v":2400,"d":"2400.00"},"Empuje dificultoso",{"$f":"IF(Tabla1[[#This Row],[Nivel de empuje]]=\"Empuje facil\",1.1,IF(Tabla1[[#This Row],[Nivel de empuje]]=\"Empuje promedio\",0.9,IF(Tabla1[[#This Row],[Nivel de empuje]]=\"Empuje medio dificultoso\",0.7,IF(Tabla1[[#This Row],[Nivel de empuje]]=\"Empuje dificultoso\",0.6,\" \"))))","v":{"v":0.6,"d":"0.60"}},0.45,{"$f":"Tabla1[[#This Row],[Ancho ]]*(Tabla1[[#This Row],[Altura ]]^2)*Tabla1[[#This Row],[Factor Hoja]]","v":{"v":4.134827999999999,"d":"4.135"}},{"$f":"Tabla1[[#This Row],[Producción por ciclo ]]/(Tabla1[[#This Row],[Profundidad]]*Tabla1[[#This Row],[Ancho ]])","v":{"v":1.3231449599999996,"d":"1.32"}},{"$f":"MROUND(3*Tabla1[[#This Row],[Longitud ]],10)","v":{"v":20,"d":"20.00"}},{"$f":"Tabla1[[#This Row],[Producción por ciclo ]]/(Tabla1[[#This Row],[dmin]]*Tabla1[[#This Row],[Ancho ]])","v":{"v":0.04134827999999999,"d":"0.0413"}},{"$f":"IF(Tabla1[[#This Row],[Profundidad]]>Tabla1[[#This Row],[Profundidad de trabajo ]],\"Conforme\",\"No conforme\")","v":"Conforme"},{"$f":"Tabla1[[#This Row],[Densidad ]]*Tabla1[[#This Row],[Producción por ciclo ]]","v":{"v":9923.587199999998,"d":"9923.59"}},{"v":0.1,"d":"0.10"},{"$f":"Tabla1[[#This Row],[Peso ]]+Tabla1[[#This Row],[Peso de material]]","v":{"v":47843.587199999994,"d":"47843.59"}},{"$f":"(Tabla1[[#This Row],[Factor de tracción ]]*Tabla1[[#This Row],[Carga total]])/1000","v":{"v":21.529614239999997,"d":"21.53"}},{"v":2.6,"d":"2.60"},{"v":1.5,"d":"1.50"},{"$f":"Tabla1[[#This Row],[dmin]]/(Tabla1[[#This Row],[Velod. Avance]]*1000/60)","v":{"v":0.4615384615384615,"d":"0.46"}},{"$f":"Tabla1[[#This Row],[dmin]]/(Tabla1[[#This Row],[Velod. Retroceso]]*1000/60)","v":{"v":0.8,"d":"0.80"}},{"$f":"Tabla1[[#This Row],[Power shift]]+Tabla1[[#This Row],[T. Avance]]+Tabla1[[#This Row],[T. Retroceso]]","v":{"v":1.3615384615384616,"d":"1.36"}},0.69,{"$f":"(Tabla1[[#This Row],[Producción por ciclo ]]*60*Tabla1[[#This Row],[Eficiencia]])/Tabla1[[#This Row],[Cm]]","v":{"v":125.72680393220334,"d":"125.73"}}]
["D8R",{"v":37920,"d":"37920.00"},"Orientación",{"v":6.57,"d":"6.570"},{"v":5,"d":"5.000"},1.174,0.625,"Arcilla seca ",{"v":1480,"d":"1480.00"},"Empuje medio dificultoso",{"$f":"IF(Tabla1[[#This Row],[Nivel de empuje]]=\"Empuje facil\",1.1,IF(Tabla1[[#This Row],[Nivel de empuje]]=\"Empuje promedio\",0.9,IF(Tabla1[[#This Row],[Nivel de empuje]]=\"Empuje medio dificultoso\",0.7,IF(Tabla1[[#This Row],[Nivel de empuje]]=\"Empuje dificultoso\",0.6,\" \"))))","v":{"v":0.7,"d":"0.70"}},{"v":0.9,"d":"0.90"},{"$f":"Tabla1[[#This Row],[Ancho ]]*(Tabla1[[#This Row],[Altura ]]^2)*Tabla1[[#This Row],[Factor Hoja]]","v":{"v":4.823965999999999,"d":"4.824"}},{"$f":"Tabla1[[#This Row],[Producción por ciclo ]]/(Tabla1[[#This Row],[Profundidad]]*Tabla1[[#This Row],[Ancho ]])","v":{"v":1.5436691199999997,"d":"1.54"}},{"$f":"MROUND(3*Tabla1[[#This Row],[Longitud ]],10)","v":{"v":20,"d":"20.00"}},{"$f":"Tabla1[[#This Row],[Producción por ciclo ]]/(Tabla1[[#This Row],[dmin]]*Tabla1[[#This Row],[Ancho ]])","v":{"v":0.04823965999999999,"d":"0.0482"}},{"$f":"IF(Tabla1[[#This Row],[Profundidad]]>Tabla1[[#This Row],[Profundidad de trabajo ]],\"Conforme\",\"No conforme\")","v":"Conforme"},{"$f":"Tabla1[[#This Row],[Densidad ]]*Tabla1[[#This Row],[Producción por ciclo ]]","v":{"v":7139.469679999998,"d":"7139.47"}},{"v":0.1,"d":"0.10"},{"$f":"Tabla1[[#This Row],[Peso ]]+Tabla1[[#This Row],[Peso de material]]","v":{"v":45059.469679999995,"d":"45059.47"}},{"$f":"(Tabla1[[#This Row],[Factor de tracción ]]*Tabla1[[#This Row],[Carga total]])/1000","v":{"v":40.553522711999996,"d":"40.55"}},{"v":1.4,"d":"1.40"},{"v":1.5,"d":"1.50"},{"$f":"Tabla1[[#This Row],[dmin]]/(Tabla1[[#This Row],[Velod. Avance]]*1000/60)","v":{"v":0.8571428571428572,"d":"0.86"}},{"$f":"Tabla1[[#This Row],[dmin]]/(Tabla1[[#This Row],[Velod. Retroceso]]*1000/60)","v":{"v":0.8,"d":"0.80"}},{"$f":"Tabla1[[#This Row],[Power shift]]+Tabla1[[#This Row],[T. Avance]]+Tabla1[[#This Row],[T. Retroceso]]","v":{"v":1.7571428571428571,"d":"1.76"}},0.69,{"$f":"(Tabla1[[#This Row],[Producción por ciclo ]]*60*Tabla1[[#This Row],[Eficiencia]])/Tabla1[[#This Row],[Cm]]","v":{"v":113.65734526829264,"d":"113.66"}}]
["D8R",{"v":37920,"d":"37920.00"},"Orientación",{"v":6.57,"d":"6.570"},{"v":5,"d":"5.000"},1.174,0.625,"Arcilla húmeda",{"v":1660,"d":"1660.00"},"Empuje facil",{"$f":"IF(Tabla1[[#This Row],[Nivel de empuje]]=\"Empuje facil\",1.1,IF(Tabla1[[#This Row],[Nivel de empuje]]=\"Empuje promedio\",0.9,IF(Tabla1[[#This Row],[Nivel de empuje]]=\"Empuje medio dificultoso\",0.7,IF(Tabla1[[#This Row],[Nivel de empuje]]=\"Empuje dificultoso\",0.6,\" \"))))","v":{"v":1.1,"d":"1.10"}},{"v":0.7,"d":"0.70"},{"$f":"Tabla1[[#This Row],[Ancho ]]*(Tabla1[[#This Row],[Altura ]]^2)*Tabla1[[#This Row],[Factor Hoja]]","v":{"v":7.580518,"d":"7.581"}},{"$f":"Tabla1[[#This Row],[Producción por ciclo ]]/(Tabla1[[#This Row],[Profundidad]]*Tabla1[[#This Row],[Ancho ]])","v":{"v":2.42576576,"d":"2.43"}},{"$f":"MROUND(3*Tabla1[[#This Row],[Longitud ]],10)","v":{"v":20,"d":"20.00"}},{"$f":"Tabla1[[#This Row],[Producción por ciclo ]]/(Tabla1[[#This Row],[dmin]]*Tabla1[[#This Row],[Ancho ]])","v":{"v":0.07580518,"d":"0.0758"}},{"$f":"IF(Tabla1[[#This Row],[Profundidad]]>Tabla1[[#This Row],[Profundidad de trabajo ]],\"Conforme\",\"No conforme\")","v":"Conforme"},{"$f":"Tabla1[[#This Row],[Densidad ]]*Tabla1[[#This Row],[Producción por ciclo ]]","v":{"v":12583.65988,"d":"12583.66"}},{"v":0.1,"d":"0.10"},{"$f":"Tabla1[[#This Row],[Peso ]]+Tabla1[[#This Row],[Peso de material]]","v":{"v":50503.65988,"d":"50503.66"}},{"$f":"(Tabla1[[#This Row],[Factor de tracción ]]*Tabla1[[#This Row],[Carga total]])/1000","v":{"v":35.352561916,"d":"35.35"}},{"v":1.7,"d":"1.70"},{"v":1.5,"d":"1.50"},{"$f":"Tabla1[[#This Row],[dmin]]/(Tabla1[[#This Row],[Velod. Avance]]*1000/60)","v":{"v":0.7058823529411765,"d":"0.71"}},{"$f":"Tabla1[[#This Row],[dmin]]/(Tabla1[[#This Row],[Velod. Retroceso]]*1000/60)","v":{"v":0.8,"d":"0.80"}},{"$f":"Tabla1[[#This Row],[Power shift]]+Tabla1[[#This Row],[T. Avance]]+Tabla1[[#This Row],[T. Retroceso]]","v":{"v":1.6058823529411765,"d":"1.61"}},0.69,{"$f":"(Tabla1[[#This Row],[Producción por ciclo ]]*60*Tabla1[[#This Row],[Eficiencia]])/Tabla1[[#This Row],[Cm]]","v":{"v":195.42742008791205,"d":"195.43"}}]
["D8R",{"v":37920,"d":"37920.00"},"Orientación",{"v":6.57,"d":"6.570"},{"v":5,"d":"5.000"},1.174,0.625,"Arena seca ",{"v":1420,"d":"1420.00"},"Empuje facil",{"$f":"IF(Tabla1[[#This Row],[Nivel de empuje]]=\"Empuje facil\",1.1,IF(Tabla1[[#This Row],[Nivel de empuje]]=\"Empuje promedio\",0.9,IF(Tabla1[[#This Row],[Nivel de empuje]]=\"Empuje medio dificultoso\",0.7,IF(Tabla1[[#This Row],[Nivel de empuje]]=\"Empuje dificultoso\",0.6,\" \"))))","v":{"v":1.1,"d":"1.10"}},0.39,{"$f":"Tabla1[[#This Row],[Ancho ]]*(Tabla1[[#This Row],[Altura ]]^2)*Tabla1[[#This Row],[Factor Hoja]]","v":{"v":7.580518,"d":"7.581"}},{"$f":"Tabla1[[#This Row],[Producción por ciclo ]]/(Tabla1[[#This Row],[Profundidad]]*Tabla1[[#This Row],[Ancho ]])","v":{"v":2.42576576,"d":"2.43"}},{"$f":"MROUND(3*Tabla1[[#This Row],[Longitud ]],10)","v":{"v":20,"d":"20.00"}},{"$f":"Tabla1[[#This Row],[Producción por ciclo ]]/(Tabla1[[#This Row],[dmin]]*Tabla1[[#This Row],[Ancho ]])","v":{"v":0.07580518,"d":"0.0758"}},{"$f":"IF(Tabla1[[#This Row],[Profundidad]]>Tabla1[[#This Row],[Profundidad de trabajo ]],\"Conforme\",\"No conforme\")","v":"Conforme"},{"$f":"Tabla1[[#This Row],[Densidad ]]*Tabla1[[#This Row],[Producción por ciclo ]]","v":{"v":10764.33556,"d":"10764.34"}},{"v":0.1,"d":"0.10"},{"$f":"Tabla1[[#This Row],[Peso ]]+Tabla1[[#This Row],[Peso de material]]","v":{"v":48684.33556,"d":"48684.34"}},{"$f":"(Tabla1[[#This Row],[Factor de tracción ]]*Tabla1[[#This Row],[Carga total]])/1000","v":{"v":18.986890868400003,"d":"18.99"}},2.75,{"v":1.5,"d":"1.50"},{"$f":"Tabla1[[#This Row],[dmin]]/(Tabla1[[#This Row],[Velod. Avance]]*1000/60)","v":{"v":0.43636363636363634,"d":"0.44"}},{"$f":"Tabla1[[#This Row],[dmin]]/(Tabla1[[#This Row],[Velod. Retroceso]]*1000/60)","v":{"v":0.8,"d":"0.80"}},{"$f":"Tabla1[[#This Row],[Power shift]]+Tabla1[[#This Row],[T. Avance]]+Tabla1[[#This Row],[T. Retroceso]]","v":{"v":1.3363636363636364,"d":"1.34"}},0.69,{"$f":"(Tabla1[[#This Row],[Producción por ciclo ]]*60*Tabla1[[#This Row],[Eficiencia]])/Tabla1[[#This Row],[Cm]]","v":{"v":234.84135355102038,"d":"234.84"}}]
["D8R",{"v":37920,"d":"37920.00"},"Orientación",{"v":6.57,"d":"6.570"},{"v":5,"d":"5.000"},1.174,0.625,"Arena húmeda ",{"v":1690,"d":"1690.00"},"Empuje medio dificultoso",{"$f":"IF(Tabla1[[#This Row],[Nivel de empuje]]=\"Empuje facil\",1.1,IF(Tabla1[[#This Row],[Nivel de empuje]]=\"Empuje promedio\",0.9,IF(Tabla1[[#This Row],[Nivel de empuje]]=\"Empuje medio dificultoso\",0.7,IF(Tabla1[[#This Row],[Nivel de empuje]]=\"Empuje dificultoso\",0.6,\" \"))))","v":{"v":0.7,"d":"0.70"}},{"v":0.5,"d":"0.50"},{"$f":"Tabla1[[#This Row],[Ancho ]]*(Tabla1[[#This Row],[Altura ]]^2)*Tabla1[[#This Row],[Factor Hoja]]","v":{"v":4.823965999999999,"d":"4.824"}},{"$f":"Tabla1[[#This Row],[Producción por ciclo ]]/(Tabla1[[#This Row],[Profundidad]]*Tabla1[[#This Row],[Ancho ]])","v":{"v":1.5436691199999997,"d":"1.54"}},{"$f":"MROUND(3*Tabla1[[#This Row],[Longitud ]],10)","v":{"v":20,"d":"20.00"}},{"$f":"Tabla1[[#This Row],[Producción por ciclo ]]/(Tabla1[[#This Row],[dmin]]*Tabla1[[#This Row],[Ancho ]])","v":{"v":0.04823965999999999,"d":"0.0482"}},{"$f":"IF(Tabla1[[#This Row],[Profundidad]]>Tabla1[[#This Row],[Profundidad de trabajo ]],\"Conforme\",\"No conforme\")","v":"Conforme"},{"$f":"Tabla1[[#This Row],[Densidad ]]*Tabla1[[#This Row],[Producción por ciclo ]]","v":{"v":8152.502539999998,"d":"8152.50"}},{"v":0.1,"d":"0.10"},{"$f":"Tabla1[[#This Row],[Peso ]]+Tabla1[[#This Row],[Peso de material]]","v":{"v":46072.50254,"d":"46072.50"}},{"$f":"(Tabla1[[#This Row],[Factor de tracción ]]*Tabla1[[#This Row],[Carga total]])/1000","v":{"v":23.03625127,"d":"23.04"}},{"v":2.5,"d":"2.50"},{"v":1.5,"d":"1.50"},{"$f":"Tabla1[[#This Row],[dmin]]/(Tabla1[[#This Row],[Velod. Avance]]*1000/60)","v":{"v":0.48000000000000004,"d":"0.48"}},{"$f":"Tabla1[[#This Row],[dmin]]/(Tabla1[[#This Row],[Velod. Retroceso]]*1000/60)","v":{"v":0.8,"d":"0.80"}},{"$f":"Tabla1[[#This Row],[Power shift]]+Tabla1[[#This Row],[T. Avance]]+Tabla1[[#This Row],[T. Retroceso]]","v":{"v":1.3800000000000001,"d":"1.38"}},0.69,{"$f":"(Tabla1[[#This Row],[Producción por ciclo ]]*60*Tabla1[[#This Row],[Eficiencia]])/Tabla1[[#This Row],[Cm]]","v":{"v":144.71897999999993,"d":"144.72"}}]
["D8R",{"v":37920,"d":"37920.00"},"Orientación",{"v":6.57,"d":"6.570"},{"v":5,"d":"5.000"},1.174,0.625,"Grava suelta ",{"v":1930,"d":"1930.00"},"Empuje promedio",{"$f":"IF(Tabla1[[#This Row],[Nivel de empuje]]=\"Empuje facil\",1.1,IF(Tabla1[[#This Row],[Nivel de empuje]]=\"Empuje promedio\",0.9,IF(Tabla1[[#This Row],[Nivel de empuje]]=\"Empuje medio dificultoso\",0.7,IF(Tabla1[[#This Row],[Nivel de empuje]]=\"Empuje dificultoso\",0.6,\" \"))))","v":{"v":0.9,"d":"0.90"}},{"v":0.5,"d":"0.50"},{"$f":"Tabla1[[#This Row],[Ancho ]]*(Tabla1[[#This Row],[Altura ]]^2)*Tabla1[[#This Row],[Factor Hoja]]","v":{"v":6.202241999999999,"d":"6.202"}},{"$f":"Tabla1[[#This Row],[Producción por ciclo ]]/(Tabla1[[#This Row],[Profundidad]]*Tabla1[[#This Row],[Ancho ]])","v":{"v":1.9847174399999998,"d":"1.98"}},{"$f":"MROUND(3*Tabla1[[#This Row],[Longitud ]],10)","v":{"v":20,"d":"20.00"}},{"$f":"Tabla1[[#This Row],[Producción por ciclo ]]/(Tabla1[[#This Row],[dmin]]*Tabla1[[#This Row],[Ancho ]])","v":{"v":0.062022419999999995,"d":"0.0620"}},{"$f":"IF(Tabla1[[#This Row],[Profundidad]]>Tabla1[[#This Row],[Profundidad de trabajo ]],\"Conforme\",\"No conforme\")","v":"Conforme"},{"$f":"Tabla1[[#This Row],[Densidad ]]*Tabla1[[#This Row],[Producción por ciclo ]]","v":{"v":11970.327059999998,"d":"11970.33"}},{"v":0.1,"d":"0.10"},{"$f":"Tabla1[[#This Row],[Peso ]]+Tabla1[[#This Row],[Peso de material]]","v":{"v":49890.327059999996,"d":"49890.33"}},{"$f":"(Tabla1[[#This Row],[Factor de tracción ]]*Tabla1[[#This Row],[Carga total]])/1000","v":{"v":24.94516353,"d":"24.95"}},{"v":2.6,"d":"2.60"},{"v":1.5,"d":"1.50"},{"$f":"Tabla1[[#This Row],[dmin]]/(Tabla1[[#This Row],[Velod. Avance]]*1000/60)","v":{"v":0.4615384615384615,"d":"0.46"}},{"$f":"Tabla1[[#This Row],[dmin]]/(Tabla1[[#This Row],[Velod. Retroceso]]*1000/60)","v":{"v":0.8,"d":"0.80"}},{"$f":"Tabla1[[#This Row],[Power shift]]+Tabla1[[#This Row],[T. Avance]]+Tabla1[[#This Row],[T. Retroceso]]","v":{"v":1.3615384615384616,"d":"1.36"}},0.69,{"$f":"(Tabla1[[#This Row],[Producción por ciclo ]]*60*Tabla1[[#This Row],[Eficiencia]])/Tabla1[[#This Row],[Cm]]","v":{"v":188.59020589830502,"d":"188.59"}}]
["D8R",{"v":37920,"d":"37920.00"},"Orientación",{"v":6.57,"d":"6.570"},{"v":5,"d":"5.000"},1.174,0.625,"Nieve compacta",{"v":130,"d":"130.00"},"Empuje medio dificultoso",{"$f":"IF(Tabla1[[#This Row],[Nivel de empuje]]=\"Empuje facil\",1.1,IF(Tabla1[[#This Row],[Nivel de empuje]]=\"Empuje promedio\",0.9,IF(Tabla1[[#This Row],[Nivel de empuje]]=\"Empuje medio dificultoso\",0.7,IF(Tabla1[[#This Row],[Nivel de empuje]]=\"Empuje dificultoso\",0.6,\" \"))))","v":{"v":0.7,"d":"0.70"}},0.27,{"$f":"Tabla1[[#This Row],[Ancho ]]*(Tabla1[[#This Row],[Altura ]]^2)*Tabla1[[#This Row],[Factor Hoja]]","v":{"v":4.823965999999999,"d":"4.824"}},{"$f":"Tabla1[[#This Row],[Producción por ciclo ]]/(Tabla1[[#This Row],[Profundidad]]*Tabla1[[#This Row],[Ancho ]])","v":{"v":1.5436691199999997,"d":"1.54"}},{"$f":"MROUND(3*Tabla1[[#This Row],[Longitud ]],10)","v":{"v":20,"d":"20.00"}},{"$f":"Tabla1[[#This Row],[Producción por ciclo ]]/(Tabla1[[#This Row],[dmin]]*Tabla1[[#This Row],[Ancho ]])","v":{"v":0.04823965999999999,"d":"0.0482"}},{"$f":"IF(Tabla1[[#This Row],[Profundidad]]>Tabla1[[#This Row],[Profundidad de trabajo ]],\"Conforme\",\"No conforme\")","v":"Conforme"},{"$f":"Tabla1[[#This Row],[Densidad ]]*Tabla1[[#This Row],[Producción por ciclo ]]","v":{"v":627.1155799999998,"d":"627.12"}},{"v":0.1,"d":"0.10"},{"$f":"Tabla1[[#This Row],[Peso ]]+Tabla1[[#This Row],[Peso de material]]","v":{"v":38547.11558,"d":"38547.12"}},{"$f":"(Tabla1[[#This Row],[Factor de tracción ]]*Tabla1[[#This Row],[Carga total]])/1000","v":{"v":10.4077212066,"d":"10.41"}},{"v":5.3,"d":"5.30"},{"v":1.5,"d":"1.50"},{"$f":"Tabla1[[#This Row],[dmin]]/(Tabla1[[#This Row],[Velod. Avance]]*1000/60)","v":{"v":0.22641509433962265,"d":"0.23"}},{"$f":"Tabla1[[#This Row],[dmin]]/(Tabla1[[#This Row],[Velod. Retroceso]]*1000/60)","v":{"v":0.8,"d":"0.80"}},{"$f":"Tabla1[[#This Row],[Power shift]]+Tabla1[[#This Row],[T. Avance]]+Tabla1[[#This Row],[T. Retroceso]]","v":{"v":1.1264150943396227,"d":"1.13"}},0.69,{"$f":"(Tabla1[[#This Row],[Producción por ciclo ]]*60*Tabla1[[#This Row],[Eficiencia]])/Tabla1[[#This Row],[Cm]]","v":{"v":177.29893127638184,"d":"177.30"}}]
["D8R",{"v":37920,"d":"37920.00"},"Orientación",{"v":6.57,"d":"6.570"},{"v":5,"d":"5.000"},1.174,0.625,"Hielo ",{"v":520,"d":"520.00"},"Empuje dificultoso",{"$f":"IF(Tabla1[[#This Row],[Nivel de empuje]]=\"Empuje facil\",1.1,IF(Tabla1[[#This Row],[Nivel de empuje]]=\"Empuje promedio\",0.9,IF(Tabla1[[#This Row],[Nivel de empuje]]=\"Empuje medio dificultoso\",0.7,IF(Tabla1[[#This Row],[Nivel de empuje]]=\"Empuje dificultoso\",0.6,\" \"))))","v":{"v":0.6,"d":"0.60"}},0.12,{"$f":"Tabla1[[#This Row],[Ancho ]]*(Tabla1[[#This Row],[Altura ]]^2)*Tabla1[[#This Row],[Factor Hoja]]","v":{"v":4.134827999999999,"d":"4.135"}},{"$f":"Tabla1[[#This Row],[Producción por ciclo ]]/(Tabla1[[#This Row],[Profundidad]]*Tabla1[[#This Row],[Ancho ]])","v":{"v":1.3231449599999996,"d":"1.32"}},{"$f":"MROUND(3*Tabla1[[#This Row],[Longitud ]],10)","v":{"v":20,"d":"20.00"}},{"$f":"Tabla1[[#This Row],[Producción por ciclo ]]/(Tabla1[[#This Row],[dmin]]*Tabla1[[#This Row],[Ancho ]])","v":{"v":0.04134827999999999,"d":"0.0413"}},{"$f":"IF(Tabla1[[#This Row],[Profundidad]]>Tabla1[[#This Row],[Profundidad de trabajo ]],\"Conforme\",\"No conforme\")","v":"Conforme"},{"$f":"Tabla1[[#This Row],[Densidad ]]*Tabla1[[#This Row],[Producción por ciclo ]]","v":{"v":2150.110559999999,"d":"2150.11"}},{"v":0.1,"d":"0.10"},{"$f":"Tabla1[[#This Row],[Peso ]]+Tabla1[[#This Row],[Peso de material]]","v":{"v":40070.11056,"d":"40070.11"}},{"$f":"(Tabla1[[#This Row],[Factor de tracción ]]*Tabla1[[#This Row],[Carga total]])/1000","v":{"v":4.8084132672,"d":"4.81"}},8.95,{"v":1.5,"d":"1.50"},{"$f":"Tabla1[[#This Row],[dmin]]/(Tabla1[[#This Row],[Velod. Avance]]*1000/60)","v":{"v":0.1340782122905028,"d":"0.13"}},{"$f":"Tabla1[[#This Row],[dmin]]/(Tabla1[[#This Row],[Velod. Retroceso]]*1000/60)","v":{"v":0.8,"d":"0.80"}},{"$f":"Tabla1[[#This Row],[Power shift]]+Tabla1[[#This Row],[T. Avance]]+Tabla1[[#This Row],[T. Retroceso]]","v":{"v":1.0340782122905028,"d":"1.03"}},0.69,{"$f":"(Tabla1[[#This Row],[Producción por ciclo ]]*60*Tabla1[[#This Row],[Eficiencia]])/Tabla1[[#This Row],[Cm]]","v":{"v":165.54055308914096,"d":"165.54"}}]
["D8R",{"v":37920,"d":"37920.00"},"Orientación",{"v":6.57,"d":"6.570"},{"v":5,"d":"5.000"},1.174,0.625,"Tierra firme ",{"v":1510,"d":"1510.00"},"Empuje facil",{"$f":"IF(Tabla1[[#This Row],[Nivel de empuje]]=\"Empuje facil\",1.1,IF(Tabla1[[#This Row],[Nivel de empuje]]=\"Empuje promedio\",0.9,IF(Tabla1[[#This Row],[Nivel de empuje]]=\"Empuje medio dificultoso\",0.7,IF(Tabla1[[#This Row],[Nivel de empuje]]=\"Empuje dificultoso\",0.6,\" \"))))","v":{"v":1.1,"d":"1.10"}},{"v":0.9,"d":"0.90"},{"$f":"Tabla1[[#This Row],[Ancho ]]*(Tabla1[[#This Row],[Altura ]]^2)*Tabla1[[#This Row],[Factor Hoja]]","v":{"v":7.580518,"d":"7.581"}},{"$f":"Tabla1[[#This Row],[Producción por ciclo ]]/(Tabla1[[#This Row],[Profundidad]]*Tabla1[[#This Row],[Ancho ]])","v":{"v":2.42576576,"d":"2.43"}},{"$f":"MROUND(3*Tabla1[[#This Row],[Longitud ]],10)","v":{"v":20,"d":"20.00"}},{"$f":"Tabla1[[#This Row],[Producción por ciclo ]]/(Tabla1[[#This Row],[dmin]]*Tabla1[[#This Row],[Ancho ]])","v":{"v":0.07580518,"d":"0.0758"}},{"$f":"IF(Tabla1[[#This Row],[Profundidad]]>Tabla1[[#This Row],[Profundidad de trabajo ]],\"Conforme\",\"No conforme\")","v":"Conforme"},{"$f":"Tabla1[[#This Row],[Densidad ]]*Tabla1[[#This Row],[Producción por ciclo ]]","v":{"v":11446.58218,"d":"11446.58"}},{"v":0.1,"d":"0.10"},{"$f":"Tabla1[[#This Row],[Peso ]]+Tabla1[[#This Row],[Peso de material]]","v":{"v":49366.58218,"d":"49366.58"}},{"$f":"(Tabla1[[#This Row],[Factor de tracción ]]*Tabla1[[#This Row],[Carga total]])/1000","v":{"v":44.429923962000004,"d":"44.43"}},1.08,{"v":1.5,"d":"1.50"},{"$f":"Tabla1[[#This Row],[dmin]]/(Tabla1[[#This Row],[Velod. Avance]]*1000/60)","v":{"v":1.1111111111111112,"d":"1.11"}},{"$f":"Tabla1[[#This Row],[dmin]]/(Tabla1[[#This Row],[Velod. Retroceso]]*1000/60)","v":{"v":0.8,"d":"0.80"}},{"$f":"Tabla1[[#This Row],[Power shift]]+Tabla1[[#This Row],[T. Avance]]+Tabla1[[#This Row],[T. Retroceso]]","v":{"v":2.011111111111111,"d":"2.01"}},0.69,{"$f":"(Tabla1[[#This Row],[Producción por ciclo ]]*60*Tabla1[[#This Row],[Eficiencia]])/Tabla1[[#This Row],[Cm]]","v":{"v":156.04977938121547,"d":"156.05"}}]
["D8R",{"v":37920,"d":"37920.00"},"Orientación",{"v":6.57,"d":"6.570"},{"v":5,"d":"5.000"},1.174,0.625,"Tierra suelta ",{"v":1250,"d":"1250.00"},"Empuje facil",{"$f":"IF(Tabla1[[#This Row],[Nivel de empuje]]=\"Empuje facil\",1.1,IF(Tabla1[[#This Row],[Nivel de empuje]]=\"Empuje promedio\",0.9,IF(Tabla1[[#This Row],[Nivel de empuje]]=\"Empuje medio dificultoso\",0.7,IF(Tabla1[[#This Row],[Nivel de empuje]]=\"Empuje dificultoso\",0.6,\" \"))))","v":{"v":1.1,"d":"1.10"}},{"v":0.6,"d":"0.60"},{"$f":"Tabla1[[#This Row],[Ancho ]]*(Tabla1[[#This Row],[Altura ]]^2)*Tabla1[[#This Row],[Factor Hoja]]","v":{"v":7.580518,"d":"7.581"}},{"$f":"Tabla1[[#This Row],[Producción por ciclo ]]/(Tabla1[[#This Row],[Profundidad]]*Tabla1[[#This Row],[Ancho ]])","v":{"v":2.42576576,"d":"2.43"}},{"$f":"MROUND(3*Tabla1[[#This Row],[Longitud ]],10)","v":{"v":20,"d":"20.00"}},{"$f":"Tabla1[[#This Row],[Producción por ciclo ]]/(Tabla1[[#This Row],[dmin]]*Tabla1[[#This Row],[Ancho ]])","v":{"v":0.07580518,"d":"0.0758"}},{"$f":"IF(Tabla1[[#This Row],[Profundidad]]>Tabla1[[#This Row],[Profundidad de trabajo ]],\"Conforme\",\"No conforme\")","v":"Conforme"},{"$f":"Tabla1[[#This Row],[Densidad ]]*Tabla1[[#This Row],[Producción por ciclo ]]","v":{"v":9475.6475,"d":"9475.65"}},{"$f":"2*0.05","v":{"v":0.1,"d":"0.10"}},{"$f":"Tabla1[[#This Row],[Peso ]]+Tabla1[[#This Row],[Peso de material]]","v":{"v":47395.6475,"d":"47395.65"}},{"$f":"(Tabla1[[#This Row],[Factor de tracción ]]*Tabla1[[#This Row],[Carga total]])/1000","v":{"v":28.437388499999997,"d":"28.44"}},{"v":2.1,"d":"2.10"},{"v":1.5,"d":"1.50"},{"$f":"Tabla1[[#This Row],[dmin]]/(Tabla1[[#This Row],[Velod. Avance]]*1000/60)","v":{"v":0.5714285714285714,"d":"0.57"}},{"$f":"Tabla1[[#This Row],[dmin]]/(Tabla1[[#This Row],[Velod. Retroceso]]*1000/60)","v":{"v":0.8,"d":"0.80"}},{"$f":"Tabla1[[#This Row],[Power shift]]+Tabla1[[#This Row],[T. Avance]]+Tabla1[[#This Row],[T. Retroceso]]","v":{"v":1.4714285714285715,"d":"1.47"}},0.69,{"$f":"(Tabla1[[#This Row],[Producción por ciclo ]]*60*Tabla1[[#This Row],[Eficiencia]])/Tabla1[[#This Row],[Cm]]","v":{"v":213.28486566990287,"d":"213.28"}}]
["D8R",{"v":37920,"d":"37920.00"},"Orientación",{"v":6.57,"d":"6.570"},{"v":5,"d":"5.000"},1.174,0.625,"Carbón ",{"v":1190,"d":"1190.00"},"Empuje promedio",{"$f":"IF(Tabla1[[#This Row],[Nivel de empuje]]=\"Empuje facil\",1.1,IF(Tabla1[[#This Row],[Nivel de empuje]]=\"Empuje promedio\",0.9,IF(Tabla1[[#This Row],[Nivel de empuje]]=\"Empuje medio dificultoso\",0.7,IF(Tabla1[[#This Row],[Nivel de empuje]]=\"Empuje dificultoso\",0.6,\" \"))))","v":{"v":0.9,"d":"0.90"}},{"v":0.6,"d":"0.60"},{"$f":"Tabla1[[#This Row],[Ancho ]]*(Tabla1[[#This Row],[Altura ]]^2)*Tabla1[[#This Row],[Factor Hoja]]","v":{"v":6.202241999999999,"d":"6.202"}},{"$f":"Tabla1[[#This Row],[Producción por ciclo ]]/(Tabla1[[#This Row],[Profundidad]]*Tabla1[[#This Row],[Ancho ]])","v":{"v":1.9847174399999998,"d":"1.98"}},{"$f":"MROUND(3*Tabla1[[#This Row],[Longitud ]],10)","v":{"v":20,"d":"20.00"}},{"$f":"Tabla1[[#This Row],[Producción por ciclo ]]/(Tabla1[[#This Row],[dmin]]*Tabla1[[#This Row],[Ancho ]])","v":{"v":0.062022419999999995,"d":"0.0620"}},{"$f":"IF(Tabla1[[#This Row],[Profundidad]]>Tabla1[[#This Row],[Profundidad de trabajo ]],\"Conforme\",\"No conforme\")","v":"Conforme"},{"$f":"Tabla1[[#This Row],[Densidad ]]*Tabla1[[#This Row],[Producción por ciclo ]]","v":{"v":7380.667979999999,"d":"7380.67"}},{"v":0.1,"d":"0.10"},{"$f":"Tabla1[[#This Row],[Peso ]]+Tabla1[[#This Row],[Peso de material]]","v":{"v":45300.66798,"d":"45300.67"}},{"$f":"(Tabla1[[#This Row],[Factor de tracción ]]*Tabla1[[#This Row],[Carga total]])/1000","v":{"v":27.180400788,"d":"27.18"}},{"v":2.2,"d":"2.20"},{"v":1.5,"d":"1.50"},{"$f":"Tabla1[[#This Row],[dmin]]/(Tabla1[[#This Row],[Velod. Avance]]*1000/60)","v":{"v":0.5454545454545455,"d":"0.55"}},{"$f":"Tabla1[[#This Row],[dmin]]/(Tabla1[[#This Row],[Velod. Retroceso]]*1000/60)","v":{"v":0.8,"d":"0.80"}},{"$f":"Tabla1[[#This Row],[Power shift]]+Tabla1[[#This Row],[T. Avance]]+Tabla1[[#This Row],[T. Retroceso]]","v":{"v":1.4454545454545455,"d":"1.45"}},0.69,{"$f":"(Tabla1[[#This Row],[Producción por ciclo ]]*60*Tabla1[[#This Row],[Eficiencia]])/Tabla1[[#This Row],[Cm]]","v":{"v":177.64157275471692,"d":"177.64"}}]
["D8R",{"v":37920,"d":"37920.00"},"Semi universal",{"v":6.39,"d":"6.390"},{"v":3.93,"d":"3.930"},{"v":1.69,"d":"1.690"},0.511,"Concreto ",{"v":2400,"d":"2400.00"},"Empuje dificultoso",{"$f":"IF(Tabla1[[#This Row],[Nivel de empuje]]=\"Empuje facil\",1.1,IF(Tabla1[[#This Row],[Nivel de empuje]]=\"Empuje promedio\",0.9,IF(Tabla1[[#This Row],[Nivel de empuje]]=\"Empuje medio dificultoso\",0.7,IF(Tabla1[[#This Row],[Nivel de empuje]]=\"Empuje dificultoso\",0.6,\" \"))))","v":{"v":0.6,"d":"0.60"}},0.45,{"$f":"Tabla1[[#This Row],[Ancho ]]*(Tabla1[[#This Row],[Altura ]]^2)*Tabla1[[#This Row],[Factor Hoja]]","v":{"v":6.7346838,"d":"6.735"}},{"$f":"Tabla1[[#This Row],[Producción por ciclo ]]/(Tabla1[[#This Row],[Profundidad]]*Tabla1[[#This Row],[Ancho ]])","v":{"v":3.353542074363992,"d":"3.35"}},{"$f":"MROUND(3*Tabla1[[#This Row],[Longitud ]],10)","v":{"v":20,"d":"20.00"}},{"$f":"Tabla1[[#This Row],[Producción por ciclo ]]/(Tabla1[[#This Row],[dmin]]*Tabla1[[#This Row],[Ancho ]])","v":{"v":0.085683,"d":"0.0857"}},{"$f":"IF(Tabla1[[#This Row],[Profundidad]]>Tabla1[[#This Row],[Profundidad de trabajo ]],\"Conforme\",\"No conforme\")","v":"Conforme"},{"$f":"Tabla1[[#This Row],[Densidad ]]*Tabla1[[#This Row],[Producción por ciclo ]]","v":{"v":16163.24112,"d":"16163.24"}},{"v":0.1,"d":"0.10"},{"$f":"Tabla1[[#This Row],[Peso ]]+Tabla1[[#This Row],[Peso de material]]","v":{"v":54083.24112,"d":"54083.24"}},{"$f":"(Tabla1[[#This Row],[Factor de tracción ]]*Tabla1[[#This Row],[Carga total]])/1000","v":{"v":24.337458503999997,"d":"24.34"}},{"v":2.5,"d":"2.50"},{"v":1.5,"d":"1.50"},{"$f":"Tabla1[[#This Row],[dmin]]/(Tabla1[[#This Row],[Velod. Avance]]*1000/60)","v":{"v":0.48000000000000004,"d":"0.48"}},{"$f":"Tabla1[[#This Row],[dmin]]/(Tabla1[[#This Row],[Velod. Retroceso]]*1000/60)","v":{"v":0.8,"d":"0.80"}},{"$f":"Tabla1[[#This Row],[Power shift]]+Tabla1[[#This Row],[T. Avance]]+Tabla1[[#This Row],[T. Retroceso]]","v":{"v":1.3800000000000001,"d":"1.38"}},0.69,{"$f":"(Tabla1[[#This Row],[Producción por ciclo ]]*60*Tabla1[[#This Row],[Eficiencia]])/Tabla1[[#This Row],[Cm]]","v":{"v":202.04051399999997,"d":"202.04"}}]
["D8R",{"v":37920,"d":"37920.00"},"Semi universal",{"v":6.39,"d":"6.390"},{"v":3.93,"d":"3.930"},{"v":1.69,"d":"1.690"},0.511,"Arcilla seca ",{"v":1480,"d":"1480.00"},"Empuje medio dificultoso",{"$f":"IF(Tabla1[[#This Row],[Nivel de empuje]]=\"Empuje facil\",1.1,IF(Tabla1[[#This Row],[Nivel de empuje]]=\"Empuje promedio\",0.9,IF(Tabla1[[#This Row],[Nivel de empuje]]=\"Empuje medio dificultoso\",0.7,IF(Tabla1[[#This Row],[Nivel de empuje]]=\"Empuje dificultoso\",0.6,\" \"))))","v":{"v":0.7,"d":"0.70"}},{"v":0.9,"d":"0.90"},{"$f":"Tabla1[[#This Row],[Ancho ]]*(Tabla1[[#This Row],[Altura ]]^2)*Tabla1[[#This Row],[Factor Hoja]]","v":{"v":7.857131099999999,"d":"7.857"}},{"$f":"Tabla1[[#This Row],[Producción por ciclo ]]/(Tabla1[[#This Row],[Profundidad]]*Tabla1[[#This Row],[Ancho ]])","v":{"v":3.912465753424657,"d":"3.91"}},{"$f":"MROUND(3*Tabla1[[#This Row],[Longitud ]],10)","v":{"v":20,"d":"20.00"}},{"$f":"Tabla1[[#This Row],[Producción por ciclo ]]/(Tabla1[[#This Row],[dmin]]*Tabla1[[#This Row],[Ancho ]])","v":{"v":0.09996349999999998,"d":"0.1000"}},{"$f":"IF(Tabla1[[#This Row],[Profundidad]]>Tabla1[[#This Row],[Profundidad de trabajo ]],\"Conforme\",\"No conforme\")","v":"Conforme"},{"$f":"Tabla1[[#This Row],[Densidad ]]*Tabla1[[#This Row],[Producción por ciclo ]]","v":{"v":11628.554027999999,"d":"11628.55"}},{"v":0.1,"d":"0.10"},{"$f":"Tabla1[[#This Row],[Peso ]]+Tabla1[[#This Row],[Peso de material]]","v":{"v":49548.554028,"d":"49548.55"}},{"$f":"(Tabla1[[#This Row],[Factor de tracción ]]*Tabla1[[#This Row],[Carga total]])/1000","v":{"v":44.5936986252,"d":"44.59"}},1.09,{"v":1.5,"d":"1.50"},{"$f":"Tabla1[[#This Row],[dmin]]/(Tabla1[[#This Row],[Velod. Avance]]*1000/60)","v":{"v":1.1009174311926604,"d":"1.10"}},{"$f":"Tabla1[[#This Row],[dmin]]/(Tabla1[[#This Row],[Velod. Retroceso]]*1000/60)","v":{"v":0.8,"d":"0.80"}},{"$f":"Tabla1[[#This Row],[Power shift]]+Tabla1[[#This Row],[T. Avance]]+Tabla1[[#This Row],[T. Retroceso]]","v":{"v":2.0009174311926605,"d":"2.00"}},0.69,{"$f":"(Tabla1[[#This Row],[Producción por ciclo ]]*60*Tabla1[[#This Row],[Eficiencia]])/Tabla1[[#This Row],[Cm]]","v":{"v":162.56804127400272,"d":"162.57"}}]
["D8R",{"v":37920,"d":"37920.00"},"Semi universal",{"v":6.39,"d":"6.390"},{"v":3.93,"d":"3.930"},{"v":1.69,"d":"1.690"},0.511,"Arcilla húmeda",{"v":1660,"d":"1660.00"},"Empuje facil",{"$f":"IF(Tabla1[[#This Row],[Nivel de empuje]]=\"Empuje facil\",1.1,IF(Tabla1[[#This Row],[Nivel de empuje]]=\"Empuje promedio\",0.9,IF(Tabla1[[#This Row],[Nivel de empuje]]=\"Empuje medio dificultoso\",0.7,IF(Tabla1[[#This Row],[Nivel de empuje]]=\"Empuje dificultoso\",0.6,\" \"))))","v":{"v":1.1,"d":"1.10"}},{"v":0.7,"d":"0.70"},{"$f":"Tabla1[[#This Row],[Ancho ]]*(Tabla1[[#This Row],[Altura ]]^2)*Tabla1[[#This Row],[Factor Hoja]]","v":{"v":12.3469203,"d":"12.347"}},{"$f":"Tabla1[[#This Row],[Producción por ciclo ]]/(Tabla1[[#This Row],[Profundidad]]*Tabla1[[#This Row],[Ancho ]])","v":{"v":6.148160469667319,"d":"6.15"}},{"$f":"MROUND(3*Tabla1[[#This Row],[Longitud ]],10)","v":{"v":20,"d":"20.00"}},{"$f":"Tabla1[[#This Row],[Producción por ciclo ]]/(Tabla1[[#This Row],[dmin]]*Tabla1[[#This Row],[Ancho ]])","v":{"v":0.1570855,"d":"0.1571"}},{"$f":"IF(Tabla1[[#This Row],[Profundidad]]>Tabla1[[#This Row],[Profundidad de trabajo ]],\"Conforme\",\"No conforme\")","v":"Conforme"},{"$f":"Tabla1[[#This Row],[Densidad ]]*Tabla1[[#This Row],[Producción por ciclo ]]","v":{"v":20495.887698000002,"d":"20495.89"}},{"v":0.1,"d":"0.10"},{"$f":"Tabla1[[#This Row],[Peso ]]+Tabla1[[#This Row],[Peso de material]]","v":{"v":58415.887698000006,"d":"58415.89"}},{"$f":"(Tabla1[[#This Row],[Factor de tracción ]]*Tabla1[[#This Row],[Carga total]])/1000","v":{"v":40.891121388600006,"d":"40.89"}},{"v":1.3,"d":"1.30"},{"v":1.5,"d":"1.50"},{"$f":"Tabla1[[#This Row],[dmin]]/(Tabla1[[#This Row],[Velod. Avance]]*1000/60)","v":{"v":0.923076923076923,"d":"0.92"}},{"$f":"Tabla1[[#This Row],[dmin]]/(Tabla1[[#This Row],[Velod. Retroceso]]*1000/60)","v":{"v":0.8,"d":"0.80"}},{"$f":"Tabla1[[#This Row],[Power shift]]+Tabla1[[#This Row],[T. Avance]]+Tabla1[[#This Row],[T. Retroceso]]","v":{"v":1.823076923076923,"d":"1.82"}},0.69,{"$f":"(Tabla1[[#This Row],[Producción por ciclo ]]*60*Tabla1[[#This Row],[Eficiencia]])/Tabla1[[#This Row],[Cm]]","v":{"v":280.38449390126584,"d":"280.38"}}]
["D8R",{"v":37920,"d":"37920.00"},"Semi universal",{"v":6.39,"d":"6.390"},{"v":3.93,"d":"3.930"},{"v":1.69,"d":"1.690"},0.511,"Arena seca ",{"v":1420,"d":"1420.00"},"Empuje facil",{"$f":"IF(Tabla1[[#This Row],[Nivel de empuje]]=\"Empuje facil\",1.1,IF(Tabla1[[#This Row],[Nivel de empuje]]=\"Empuje promedio\",0.9,IF(Tabla1[[#This Row],[Nivel de empuje]]=\"Empuje medio dificultoso\",0.7,IF(Tabla1[[#This Row],[Nivel de empuje]]=\"Empuje dificultoso\",0.6,\" \"))))","v":{"v":1.1,"d":"1.10"}},0.39,{"$f":"Tabla1[[#This Row],[Ancho ]]*(Tabla1[[#This Row],[Altura ]]^2)*Tabla1[[#This Row],[Factor Hoja]]","v":{"v":12.3469203,"d":"12.347"}},{"$f":"Tabla1[[#This Row],[Producción por ciclo ]]/(Tabla1[[#This Row],[Profundidad]]*Tabla1[[#This Row],[Ancho ]])","v":{"v":6.148160469667319,"d":"6.15"}},{"$f":"MROUND(3*Tabla1[[#This Row],[Longitud ]],10)","v":{"v":20,"d":"20.00"}},{"$f":"Tabla1[[#This Row],[Producción por ciclo ]]/(Tabla1[[#This Row],[dmin]]*Tabla1[[#This Row],[Ancho ]])","v":{"v":0.1570855,"d":"0.1571"}},{"$f":"IF(Tabla1[[#This Row],[Profundidad]]>Tabla1[[#This Row],[Profundidad de trabajo ]],\"Conforme\",\"No conforme\")","v":"Conforme"},{"$f":"Tabla1[[#This Row],[Densidad ]]*Tabla1[[#This Row],[Producción por ciclo ]]","v":{"v":17532.626826,"d":"17532.63"}},{"v":0.1,"d":"0.10"},{"$f":"Tabla1[[#This Row],[Peso ]]+Tabla1[[#This Row],[Peso de material]]","v":{"v":55452.626826,"d":"55452.63"}},{"$f":"(Tabla1[[#This Row],[Factor de tracción ]]*Tabla1[[#This Row],[Carga total]])/1000","v":{"v":21.62652446214,"d":"21.63"}},{"v":2.6,"d":"2.60"},{"v":1.5,"d":"1.50"},{"$f":"Tabla1[[#This Row],[dmin]]/(Tabla1[[#This Row],[Velod. Avance]]*1000/60)","v":{"v":0.4615384615384615,"d":"0.46"}},{"$f":"Tabla1[[#This Row],[dmin]]/(Tabla1[[#This Row],[Velod. Retroceso]]*1000/60)","v":{"v":0.8,"d":"0.80"}},{"$f":"Tabla1[[#This Row],[Power shift]]+Tabla1[[#This Row],[T. Avance]]+Tabla1[[#This Row],[T. Retroceso]]","v":{"v":1.3615384615384616,"d":"1.36"}},0.69,{"$f":"(Tabla1[[#This Row],[Producción por ciclo ]]*60*Tabla1[[#This Row],[Eficiencia]])/Tabla1[[#This Row],[Cm]]","v":{"v":375.4300850542373,"d":"375.43"}}]
["D8R",{"v":37920,"d":"37920.00"},"Semi universal",{"v":6.39,"d":"6.390"},{"v":3.93,"d":"3.930"},{"v":1.69,"d":"1.690"},0.511,"Arena húmeda ",{"v":1690,"d":"1690.00"},"Empuje medio dificultoso",{"$f":"IF(Tabla1[[#This Row],[Nivel de empuje]]=\"Empuje facil\",1.1,IF(Tabla1[[#This Row],[Nivel de empuje]]=\"Empuje promedio\",0.9,IF(Tabla1[[#This Row],[Nivel de empuje]]=\"Empuje medio dificultoso\",0.7,IF(Tabla1[[#This Row],[Nivel de empuje]]=\"Empuje dificultoso\",0.6,\" \"))))","v":{"v":0.7,"d":"0.70"}},{"v":0.5,"d":"0.50"},{"$f":"Tabla1[[#This Row],[Ancho ]]*(Tabla1[[#This Row],[Altura ]]^2)*Tabla1[[#This Row],[Factor Hoja]]","v":{"v":7.857131099999999,"d":"7.857"}},{"$f":"Tabla1[[#This Row],[Producción por ciclo ]]/(Tabla1[[#This Row],[Profundidad]]*Tabla1[[#This Row],[Ancho ]])","v":{"v":3.912465753424657,"d":"3.91"}},{"$f":"MROUND(3*Tabla1[[#This Row],[Longitud ]],10)","v":{"v":20,"d":"20.00"}},{"$f":"Tabla1[[#This Row],[Producción por ciclo ]]/(Tabla1[[#This Row],[dmin]]*Tabla1[[#This Row],[Ancho ]])","v":{"v":0.09996349999999998,"d":"0.1000"}},{"$f":"IF(Tabla1[[#This Row],[Profundidad]]>Tabla1[[#This Row],[Profundidad de trabajo ]],\"Conforme\",\"No conforme\")","v":"Conforme"},{"$f":"Tabla1[[#This Row],[Densidad ]]*Tabla1[[#This Row],[Producción por ciclo ]]","v":{"v":13278.551559,"d":"13278.55"}},{"v":0.1,"d":"0.10"},{"$f":"Tabla1[[#This Row],[Peso ]]+Tabla1[[#This Row],[Peso de material]]","v":{"v":51198.551559,"d":"51198.55"}},{"$f":"(Tabla1[[#This Row],[Factor de tracción ]]*Tabla1[[#This Row],[Carga total]])/1000","v":{"v":25.5992757795,"d":"25.60"}},2.28,{"v":1.5,"d":"1.50"},{"$f":"Tabla1[[#This Row],[dmin]]/(Tabla1[[#This Row],[Velod. Avance]]*1000/60)","v":{"v":0.5263157894736842,"d":"0.53"}},{"$f":"Tabla1[[#This Row],[dmin]]/(Tabla1[[#This Row],[Velod. Retroceso]]*1000/60)","v":{"v":0.8,"d":"0.80"}},{"$f":"Tabla1[[#This Row],[Power shift]]+Tabla1[[#This Row],[T. Avance]]+Tabla1[[#This Row],[T. Retroceso]]","v":{"v":1.4263157894736842,"d":"1.43"}},0.69,{"$f":"(Tabla1[[#This Row],[Producción por ciclo ]]*60*Tabla1[[#This Row],[Eficiencia]])/Tabla1[[#This Row],[Cm]]","v":{"v":228.0597536258302,"d":"228.06"}}]
["D8R",{"v":37920,"d":"37920.00"},"Semi universal",{"v":6.39,"d":"6.390"},{"v":3.93,"d":"3.930"},{"v":1.69,"d":"1.690"},0.511,"Grava suelta ",{"v":1930,"d":"1930.00"},"Empuje promedio",{"$f":"IF(Tabla1[[#This Row],[Nivel de empuje]]=\"Empuje facil\",1.1,IF(Tabla1[[#This Row],[Nivel de empuje]]=\"Empuje promedio\",0.9,IF(Tabla1[[#This Row],[Nivel de empuje]]=\"Empuje medio dificultoso\",0.7,IF(Tabla1[[#This Row],[Nivel de empuje]]=\"Empuje dificultoso\",0.6,\" \"))))","v":{"v":0.9,"d":"0.90"}},{"v":0.5,"d":"0.50"},{"$f":"Tabla1[[#This Row],[Ancho ]]*(Tabla1[[#This Row],[Altura ]]^2)*Tabla1[[#This Row],[Factor Hoja]]","v":{"v":10.1020257,"d":"10.102"}},{"$f":"Tabla1[[#This Row],[Producción por ciclo ]]/(Tabla1[[#This Row],[Profundidad]]*Tabla1[[#This Row],[Ancho ]])","v":{"v":5.030313111545988,"d":"5.03"}},{"$f":"MROUND(3*Tabla1[[#This Row],[Longitud ]],10)","v":{"v":20,"d":"20.00"}},{"$f":"Tabla1[[#This Row],[Producción por ciclo ]]/(Tabla1[[#This Row],[dmin]]*Tabla1[[#This Row],[Ancho ]])","v":{"v":0.12852449999999999,"d":"0.1285"}},{"$f":"IF(Tabla1[[#This Row],[Profundidad]]>Tabla1[[#This Row],[Profundidad de trabajo ]],\"Conforme\",\"No conforme\")","v":"Conforme"},{"$f":"Tabla1[[#This Row],[Densidad ]]*Tabla1[[#This Row],[Producción por ciclo ]]","v":{"v":19496.909601,"d":"19496.91"}},{"v":0.1,"d":"0.10"},{"$f":"Tabla1[[#This Row],[Peso ]]+Tabla1[[#This Row],[Peso de material]]","v":{"v":57416.909601,"d":"57416.91"}},{"$f":"(Tabla1[[#This Row],[Factor de tracción ]]*Tabla1[[#This Row],[Carga total]])/1000","v":{"v":28.7084548005,"d":"28.71"}},2.03,{"v":1.5,"d":"1.50"},{"$f":"Tabla1[[#This Row],[dmin]]/(Tabla1[[#This Row],[Velod. Avance]]*1000/60)","v":{"v":0.5911330049261084,"d":"0.59"}},{"$f":"Tabla1[[#This Row],[dmin]]/(Tabla1[[#This Row],[Velod. Retroceso]]*1000/60)","v":{"v":0.8,"d":"0.80"}},{"$f":"Tabla1[[#This Row],[Power shift]]+Tabla1[[#This Row],[T. Avance]]+Tabla1[[#This Row],[T. Retroceso]]","v":{"v":1.4911330049261085,"d":"1.49"}},0.69,{"$f":"(Tabla1[[#This Row],[Producción por ciclo ]]*60*Tabla1[[#This Row],[Eficiencia]])/Tabla1[[#This Row],[Cm]]","v":{"v":280.4738830126858,"d":"280.47"}}]
["D8R",{"v":37920,"d":"37920.00"},"Semi universal",{"v":6.39,"d":"6.390"},{"v":3.93,"d":"3.930"},{"v":1.69,"d":"1.690"},0.511,"Nieve compacta",{"v":130,"d":"130.00"},"Empuje medio dificultoso",{"$f":"IF(Tabla1[[#This Row],[Nivel de empuje]]=\"Empuje facil\",1.1,IF(Tabla1[[#This Row],[Nivel de empuje]]=\"Empuje promedio\",0.9,IF(Tabla1[[#This Row],[Nivel de empuje]]=\"Empuje medio dificultoso\",0.7,IF(Tabla1[[#This Row],[Nivel de empuje]]=\"Empuje dificultoso\",0.6,\" \"))))","v":{"v":0.7,"d":"0.70"}},0.27,{"$f":"Tabla1[[#This Row],[Ancho ]]*(Tabla1[[#This Row],[Altura ]]^2)*Tabla1[[#This Row],[Factor Hoja]]","v":{"v":7.857131099999999,"d":"7.857"}},{"$f":"Tabla1[[#This Row],[Producción por ciclo ]]/(Tabla1[[#This Row],[Profundidad]]*Tabla1[[#This Row],[Ancho ]])","v":{"v":3.912465753424657,"d":"3.91"}},{"$f":"MROUND(3*Tabla1[[#This Row],[Longitud ]],10)","v":{"v":20,"d":"20.00"}},{"$f":"Tabla1[[#This Row],[Producción por ciclo ]]/(Tabla1[[#This Row],[dmin]]*Tabla1[[#This Row],[Ancho ]])","v":{"v":0.09996349999999998,"d":"0.1000"}},{"$f":"IF(Tabla1[[#This Row],[Profundidad]]>Tabla1[[#This Row],[Profundidad de trabajo ]],\"Conforme\",\"No conforme\")","v":"Conforme"},{"$f":"Tabla1[[#This Row],[Densidad ]]*Tabla1[[#This Row],[Producción por ciclo ]]","v":{"v":1021.4270429999999,"d":"1021.43"}},{"v":0.1,"d":"0.10"},{"$f":"Tabla1[[#This Row],[Peso ]]+Tabla1[[#This Row],[Peso de material]]","v":{"v":38941.427043,"d":"38941.43"}},{"$f":"(Tabla1[[#This Row],[Factor de tracción ]]*Tabla1[[#This Row],[Carga total]])/1000","v":{"v":10.51418530161,"d":"10.51"}},4.78,{"v":1.5,"d":"1.50"},{"$f":"Tabla1[[#This Row],[dmin]]/(Tabla1[[#This Row],[Velod. Avance]]*1000/60)","v":{"v":0.2510460251046025,"d":"0.25"}},{"$f":"Tabla1[[#This Row],[dmin]]/(Tabla1[[#This Row],[Velod. Retroceso]]*1000/60)","v":{"v":0.8,"d":"0.80"}},{"$f":"Tabla1[[#This Row],[Power shift]]+Tabla1[[#This Row],[T. Avance]]+Tabla1[[#This Row],[T. Retroceso]]","v":{"v":1.1510460251046024,"d":"1.15"}},0.69,{"$f":"(Tabla1[[#This Row],[Producción por ciclo ]]*60*Tabla1[[#This Row],[Eficiencia]])/Tabla1[[#This Row],[Cm]]","v":{"v":282.59967059999997,"d":"282.60"}}]
["D8R",{"v":37920,"d":"37920.00"},"Semi universal",{"v":6.39,"d":"6.390"},{"v":3.93,"d":"3.930"},{"v":1.69,"d":"1.690"},0.511,"Hielo ",{"v":520,"d":"520.00"},"Empuje dificultoso",{"$f":"IF(Tabla1[[#This Row],[Nivel de empuje]]=\"Empuje facil\",1.1,IF(Tabla1[[#This Row],[Nivel de empuje]]=\"Empuje promedio\",0.9,IF(Tabla1[[#This Row],[Nivel de empuje]]=\"Empuje medio dificultoso\",0.7,IF(Tabla1[[#This Row],[Nivel de empuje]]=\"Empuje dificultoso\",0.6,\" \"))))","v":{"v":0.6,"d":"0.60"}},0.12,{"$f":"Tabla1[[#This Row],[Ancho ]]*(Tabla1[[#This Row],[Altura ]]^2)*Tabla1[[#This Row],[Factor Hoja]]","v":{"v":6.7346838,"d":"6.735"}},{"$f":"Tabla1[[#This Row],[Producción por ciclo ]]/(Tabla1[[#This Row],[Profundidad]]*Tabla1[[#This Row],[Ancho ]])","v":{"v":3.353542074363992,"d":"3.35"}},{"$f":"MROUND(3*Tabla1[[#This Row],[Longitud ]],10)","v":{"v":20,"d":"20.00"}},{"$f":"Tabla1[[#This Row],[Producción por ciclo ]]/(Tabla1[[#This Row],[dmin]]*Tabla1[[#This Row],[Ancho ]])","v":{"v":0.085683,"d":"0.0857"}},{"$f":"IF(Tabla1[[#This Row],[Profundidad]]>Tabla1[[#This Row],[Profundidad de trabajo ]],\"Conforme\",\"No conforme\")","v":"Conforme"},{"$f":"Tabla1[[#This Row],[Densidad ]]*Tabla1[[#This Row],[Producción por ciclo ]]","v":{"v":3502.035576,"d":"3502.04"}},{"v":0.1,"d":"0.10"},{"$f":"Tabla1[[#This Row],[Peso ]]+Tabla1[[#This Row],[Peso de material]]","v":{"v":41422.035576,"d":"41422.04"}},{"$f":"(Tabla1[[#This Row],[Factor de tracción ]]*Tabla1[[#This Row],[Carga total]])/1000","v":{"v":4.97064426912,"d":"4.97"}},8.95,{"v":1.5,"d":"1.50"},{"$f":"Tabla1[[#This Row],[dmin]]/(Tabla1[[#This Row],[Velod. Avance]]*1000/60)","v":{"v":0.1340782122905028,"d":"0.13"}},{"$f":"Tabla1[[#This Row],[dmin]]/(Tabla1[[#This Row],[Velod. Retroceso]]*1000/60)","v":{"v":0.8,"d":"0.80"}},{"$f":"Tabla1[[#This Row],[Power shift]]+Tabla1[[#This Row],[T. Avance]]+Tabla1[[#This Row],[T. Retroceso]]","v":{"v":1.0340782122905028,"d":"1.03"}},0.69,{"$f":"(Tabla1[[#This Row],[Producción por ciclo ]]*60*Tabla1[[#This Row],[Eficiencia]])/Tabla1[[#This Row],[Cm]]","v":{"v":269.6274865925446,"d":"269.63"}}]
["D8R",{"v":37920,"d":"37920.00"},"Semi universal",{"v":6.39,"d":"6.390"},{"v":3.93,"d":"3.930"},{"v":1.69,"d":"1.690"},0.511,"Tierra firme ",{"v":1510,"d":"1510.00"},"Empuje facil",{"$f":"IF(Tabla1[[#This Row],[Nivel de empuje]]=\"Empuje facil\",1.1,IF(Tabla1[[#This Row],[Nivel de empuje]]=\"Empuje promedio\",0.9,IF(Tabla1[[#This Row],[Nivel de empuje]]=\"Empuje medio dificultoso\",0.7,IF(Tabla1[[#This Row],[Nivel de empuje]]=\"Empuje dificultoso\",0.6,\" \"))))","v":{"v":1.1,"d":"1.10"}},{"v":0.9,"d":"0.90"},{"$f":"Tabla1[[#This Row],[Ancho ]]*(Tabla1[[#This Row],[Altura ]]^2)*Tabla1[[#This Row],[Factor Hoja]]","v":{"v":12.3469203,"d":"12.347"}},{"$f":"Tabla1[[#This Row],[Producción por ciclo ]]/(Tabla1[[#This Row],[Profundidad]]*Tabla1[[#This Row],[Ancho ]])","v":{"v":6.148160469667319,"d":"6.15"}},{"$f":"MROUND(3*Tabla1[[#This Row],[Longitud ]],10)","v":{"v":20,"d":"20.00"}},{"$f":"Tabla1[[#This Row],[Producción por ciclo ]]/(Tabla1[[#This Row],[dmin]]*Tabla1[[#This Row],[Ancho ]])","v":{"v":0.1570855,"d":"0.1571"}},{"$f":"IF(Tabla1[[#This Row],[Profundidad]]>Tabla1[[#This Row],[Profundidad de trabajo ]],\"Conforme\",\"No conforme\")","v":"Conforme"},{"$f":"Tabla1[[#This Row],[Densidad ]]*Tabla1[[#This Row],[Producción por ciclo ]]","v":{"v":18643.849653,"d":"18643.85"}},{"v":0.1,"d":"0.10"},{"$f":"Tabla1[[#This Row],[Peso ]]+Tabla1[[#This Row],[Peso de material]]","v":{"v":56563.849653,"d":"56563.85"}},{"$f":"(Tabla1[[#This Row],[Factor de tracción ]]*Tabla1[[#This Row],[Carga total]])/1000","v":{"v":50.9074646877,"d":"50.91"}},7.95,{"v":1.5,"d":"1.50"},{"$f":"Tabla1[[#This Row],[dmin]]/(Tabla1[[#This Row],[Velod. Avance]]*1000/60)","v":{"v":0.1509433962264151,"d":"0.15"}},{"$f":"Tabla1[[#This Row],[dmin]]/(Tabla1[[#This Row],[Velod. Retroceso]]*1000/60)","v":{"v":0.8,"d":"0.80"}},{"$f":"Tabla1[[#This Row],[Power shift]]+Tabla1[[#This Row],[T. Avance]]+Tabla1[[#This Row],[T. Retroceso]]","v":{"v":1.0509433962264152,"d":"1.05"}},0.69,{"$f":"(Tabla1[[#This Row],[Producción por ciclo ]]*60*Tabla1[[#This Row],[Eficiencia]])/Tabla1[[#This Row],[Cm]]","v":{"v":486.3844258933572,"d":"486.38"}}]
["D8R",{"v":37920,"d":"37920.00"},"Semi universal",{"v":6.39,"d":"6.390"},{"v":3.93,"d":"3.930"},{"v":1.69,"d":"1.690"},0.511,"Tierra suelta ",{"v":1250,"d":"1250.00"},"Empuje facil",{"$f":"IF(Tabla1[[#This Row],[Nivel de empuje]]=\"Empuje facil\",1.1,IF(Tabla1[[#This Row],[Nivel de empuje]]=\"Empuje promedio\",0.9,IF(Tabla1[[#This Row],[Nivel de empuje]]=\"Empuje medio dificultoso\",0.7,IF(Tabla1[[#This Row],[Nivel de empuje]]=\"Empuje dificultoso\",0.6,\" \"))))","v":{"v":1.1,"d":"1.10"}},{"v":0.6,"d":"0.60"},{"$f":"Tabla1[[#This Row],[Ancho ]]*(Tabla1[[#This Row],[Altura ]]^2)*Tabla1[[#This Row],[Factor Hoja]]","v":{"v":12.3469203,"d":"12.347"}},{"$f":"Tabla1[[#This Row],[Producción por ciclo ]]/(Tabla1[[#This Row],[Profundidad]]*Tabla1[[#This Row],[Ancho ]])","v":{"v":6.148160469667319,"d":"6.15"}},{"$f":"MROUND(3*Tabla1[[#This Row],[Longitud ]],10)","v":{"v":20,"d":"20.00"}},{"$f":"Tabla1[[#This Row],[Producción por ciclo ]]/(Tabla1[[#This Row],[dmin]]*Tabla1[[#This Row],[Ancho ]])","v":{"v":0.1570855,"d":"0.1571"}},{"$f":"IF(Tabla1[[#This Row],[Profundidad]]>Tabla1[[#This Row],[Profundidad de trabajo ]],\"Conforme\",\"No conforme\")","v":"Conforme"},{"$f":"Tabla1[[#This Row],[Densidad ]]*Tabla1[[#This Row],[Producción por ciclo ]]","v":{"v":15433.650375000001,"d":"15433.65"}},{"v":0.1,"d":"0.10"},{"$f":"Tabla1[[#This Row],[Peso ]]+Tabla1[[#This Row],[Peso de material]]","v":{"v":53353.650375,"d":"53353.65"}},{"$f":"(Tabla1[[#This Row],[Factor de tracción ]]*Tabla1[[#This Row],[Carga total]])/1000","v":{"v":32.012190225,"d":"32.01"}},{"v":1.8,"d":"1.80"},{"v":1.5,"d":"1.50"},{"$f":"Tabla1[[#This Row],[dmin]]/(Tabla1[[#This Row],[Velod. Avance]]*1000/60)","v":{"v":0.6666666666666666,"d":"0.67"}},{"$f":"Tabla1[[#This Row],[dmin]]/(Tabla1[[#This Row],[Velod. Retroceso]]*1000/60)","v":{"v":0.8,"d":"0.80"}},{"$f":"Tabla1[[#This Row],[Power shift]]+Tabla1[[#This Row],[T. Avance]]+Tabla1[[#This Row],[T. Retroceso]]","v":{"v":1.5666666666666667,"d":"1.57"}},0.69,{"$f":"(Tabla1[[#This Row],[Producción por ciclo ]]*60*Tabla1[[#This Row],[Eficiencia]])/Tabla1[[#This Row],[Cm]]","v":{"v":326.2739364382979,"d":"326.27"}}]
["D8R",{"v":37920,"d":"37920.00"},"Semi universal",{"v":6.39,"d":"6.390"},{"v":3.93,"d":"3.930"},{"v":1.69,"d":"1.690"},0.511,"Carbón ",{"v":1190,"d":"1190.00"},"Empuje promedio",{"$f":"IF(Tabla1[[#This Row],[Nivel de empuje]]=\"Empuje facil\",1.1,IF(Tabla1[[#This Row],[Nivel de empuje]]=\"Empuje promedio\",0.9,IF(Tabla1[[#This Row],[Nivel de empuje]]=\"Empuje medio dificultoso\",0.7,IF(Tabla1[[#This Row],[Nivel de empuje]]=\"Empuje dificultoso\",0.6,\" \"))))","v":{"v":0.9,"d":"0.90"}},{"v":0.6,"d":"0.60"},{"$f":"Tabla1[[#This Row],[Ancho ]]*(Tabla1[[#This Row],[Altura ]]^2)*Tabla1[[#This Row],[Factor Hoja]]","v":{"v":10.1020257,"d":"10.102"}},{"$f":"Tabla1[[#This Row],[Producción por ciclo ]]/(Tabla1[[#This Row],[Profundidad]]*Tabla1[[#This Row],[Ancho ]])","v":{"v":5.030313111545988,"d":"5.03"}},{"$f":"MROUND(3*Tabla1[[#This Row],[Longitud ]],10)","v":{"v":20,"d":"20.00"}},{"$f":"Tabla1[[#This Row],[Producción por ciclo ]]/(Tabla1[[#This Row],[dmin]]*Tabla1[[#This Row],[Ancho ]])","v":{"v":0.12852449999999999,"d":"0.1285"}},{"$f":"IF(Tabla1[[#This Row],[Profundidad]]>Tabla1[[#This Row],[Profundidad de trabajo ]],\"Conforme\",\"No conforme\")","v":"Conforme"},{"$f":"Tabla1[[#This Row],[Densidad ]]*Tabla1[[#This Row],[Producción por ciclo ]]","v":{"v":12021.410583,"d":"12021.41"}},{"v":0.1,"d":"0.10"},{"$f":"Tabla1[[#This Row],[Peso ]]+Tabla1[[#This Row],[Peso de material]]","v":{"v":49941.410583000004,"d":"49941.41"}},{"$f":"(Tabla1[[#This Row],[Factor de tracción ]]*Tabla1[[#This Row],[Carga total]])/1000","v":{"v":29.964846349800002,"d":"29.96"}},{"v":2,"d":"2.00"},{"v":1.5,"d":"1.50"},{"$f":"Tabla1[[#This Row],[dmin]]/(Tabla1[[#This Row],[Velod. Avance]]*1000/60)","v":{"v":0.6,"d":"0.60"}},{"$f":"Tabla1[[#This Row],[dmin]]/(Tabla1[[#This Row],[Velod. Retroceso]]*1000/60)","v":{"v":0.8,"d":"0.80"}},{"$f":"Tabla1[[#This Row],[Power shift]]+Tabla1[[#This Row],[T. Avance]]+Tabla1[[#This Row],[T. Retroceso]]","v":{"v":1.5,"d":"1.50"}},0.69,{"$f":"(Tabla1[[#This Row],[Producción por ciclo ]]*60*Tabla1[[#This Row],[Eficiencia]])/Tabla1[[#This Row],[Cm]]","v":{"v":278.81590932,"d":"278.82"}}]
["D8R",{"v":37920,"d":"37920.00"},"Universal ",{"v":6.79,"d":"6.790"},{"v":4.25,"d":"4.250"},{"v":1.74,"d":"1.740"},0.567,"Concreto ",{"v":2400,"d":"2400.00"},"Empuje dificultoso",{"$f":"IF(Tabla1[[#This Row],[Nivel de empuje]]=\"Empuje facil\",1.1,IF(Tabla1[[#This Row],[Nivel de empuje]]=\"Empuje promedio\",0.9,IF(Tabla1[[#This Row],[Nivel de empuje]]=\"Empuje medio dificultoso\",0.7,IF(Tabla1[[#This Row],[Nivel de empuje]]=\"Empuje dificultoso\",0.6,\" \"))))","v":{"v":0.6,"d":"0.60"}},0.45,{"$f":"Tabla1[[#This Row],[Ancho ]]*(Tabla1[[#This Row],[Altura ]]^2)*Tabla1[[#This Row],[Factor Hoja]]","v":{"v":7.72038,"d":"7.720"}},{"$f":"Tabla1[[#This Row],[Producción por ciclo ]]/(Tabla1[[#This Row],[Profundidad]]*Tabla1[[#This Row],[Ancho ]])","v":{"v":3.203809523809524,"d":"3.20"}},{"$f":"MROUND(3*Tabla1[[#This Row],[Longitud ]],10)","v":{"v":20,"d":"20.00"}},{"$f":"Tabla1[[#This Row],[Producción por ciclo ]]/(Tabla1[[#This Row],[dmin]]*Tabla1[[#This Row],[Ancho ]])","v":{"v":0.09082799999999999,"d":"0.0908"}},{"$f":"IF(Tabla1[[#This Row],[Profundidad]]>Tabla1[[#This Row],[Profundidad de trabajo ]],\"Conforme\",\"No conforme\")","v":"Conforme"},{"$f":"Tabla1[[#This Row],[Densidad ]]*Tabla1[[#This Row],[Producción por ciclo ]]","v":{"v":18528.912,"d":"18528.91"}},{"v":0.1,"d":"0.10"},{"$f":"Tabla1[[#This Row],[Peso ]]+Tabla1[[#This Row],[Peso de material]]","v":{"v":56448.912,"d":"56448.91"}},{"$f":"(Tabla1[[#This Row],[Factor de tracción ]]*Tabla1[[#This Row],[Carga total]])/1000","v":{"v":25.402010399999998,"d":"25.40"}},{"v":2.4,"d":"2.40"},{"v":1.5,"d":"1.50"},{"$f":"Tabla1[[#This Row],[dmin]]/(Tabla1[[#This Row],[Velod. Avance]]*1000/60)","v":{"v":0.5,"d":"0.50"}},{"$f":"Tabla1[[#This Row],[dmin]]/(Tabla1[[#This Row],[Velod. Retroceso]]*1000/60)","v":{"v":0.8,"d":"0.80"}},{"$f":"Tabla1[[#This Row],[Power shift]]+Tabla1[[#This Row],[T. Avance]]+Tabla1[[#This Row],[T. Retroceso]]","v":{"v":1.4,"d":"1.40"}},0.69,{"$f":"(Tabla1[[#This Row],[Producción por ciclo ]]*60*Tabla1[[#This Row],[Eficiencia]])/Tabla1[[#This Row],[Cm]]","v":{"v":228.3026657142857,"d":"228.30"}}]
["D8R",{"v":37920,"d":"37920.00"},"Universal ",{"v":6.79,"d":"6.790"},{"v":4.25,"d":"4.250"},{"v":1.74,"d":"1.740"},0.567,"Arcilla seca ",{"v":1480,"d":"1480.00"},"Empuje medio dificultoso",{"$f":"IF(Tabla1[[#This Row],[Nivel de empuje]]=\"Empuje facil\",1.1,IF(Tabla1[[#This Row],[Nivel de empuje]]=\"Empuje promedio\",0.9,IF(Tabla1[[#This Row],[Nivel de empuje]]=\"Empuje medio dificultoso\",0.7,IF(Tabla1[[#This Row],[Nivel de empuje]]=\"Empuje dificultoso\",0.6,\" \"))))","v":{"v":0.7,"d":"0.70"}},{"v":0.9,"d":"0.90"},{"$f":"Tabla1[[#This Row],[Ancho ]]*(Tabla1[[#This Row],[Altura ]]^2)*Tabla1[[#This Row],[Factor Hoja]]","v":{"v":9.007109999999999,"d":"9.007"}},{"$f":"Tabla1[[#This Row],[Producción por ciclo ]]/(Tabla1[[#This Row],[Profundidad]]*Tabla1[[#This Row],[Ancho ]])","v":{"v":3.7377777777777776,"d":"3.74"}},{"$f":"MROUND(3*Tabla1[[#This Row],[Longitud ]],10)","v":{"v":20,"d":"20.00"}},{"$f":"Tabla1[[#This Row],[Producción por ciclo ]]/(Tabla1[[#This Row],[dmin]]*Tabla1[[#This Row],[Ancho ]])","v":{"v":0.10596599999999999,"d":"0.1060"}},{"$f":"IF(Tabla1[[#This Row],[Profundidad]]>Tabla1[[#This Row],[Profundidad de trabajo ]],\"Conforme\",\"No conforme\")","v":"Conforme"},{"$f":"Tabla1[[#This Row],[Densidad ]]*Tabla1[[#This Row],[Producción por ciclo ]]","v":{"v":13330.522799999999,"d":"13330.52"}},{"v":0.1,"d":"0.10"},{"$f":"Tabla1[[#This Row],[Peso ]]+Tabla1[[#This Row],[Peso de material]]","v":{"v":51250.5228,"d":"51250.52"}},{"$f":"(Tabla1[[#This Row],[Factor de tracción ]]*Tabla1[[#This Row],[Carga total]])/1000","v":{"v":46.12547052,"d":"46.13"}},1.85,{"v":1.5,"d":"1.50"},{"$f":"Tabla1[[#This Row],[dmin]]/(Tabla1[[#This Row],[Velod. Avance]]*1000/60)","v":{"v":0.6486486486486487,"d":"0.65"}},{"$f":"Tabla1[[#This Row],[dmin]]/(Tabla1[[#This Row],[Velod. Retroceso]]*1000/60)","v":{"v":0.8,"d":"0.80"}},{"$f":"Tabla1[[#This Row],[Power shift]]+Tabla1[[#This Row],[T. Avance]]+Tabla1[[#This Row],[T. Retroceso]]","v":{"v":1.5486486486486486,"d":"1.55"}},0.69,{"$f":"(Tabla1[[#This Row],[Producción por ciclo ]]*60*Tabla1[[#This Row],[Eficiencia]])/Tabla1[[#This Row],[Cm]]","v":{"v":240.786930157068,"d":"240.79"}}]
["D8R",{"v":37920,"d":"37920.00"},"Universal ",{"v":6.79,"d":"6.790"},{"v":4.25,"d":"4.250"},{"v":1.74,"d":"1.740"},0.567,"Arcilla húmeda",{"v":1660,"d":"1660.00"},"Empuje facil",{"$f":"IF(Tabla1[[#This Row],[Nivel de empuje]]=\"Empuje facil\",1.1,IF(Tabla1[[#This Row],[Nivel de empuje]]=\"Empuje promedio\",0.9,IF(Tabla1[[#This Row],[Nivel de empuje]]=\"Empuje medio dificultoso\",0.7,IF(Tabla1[[#This Row],[Nivel de empuje]]=\"Empuje dificultoso\",0.6,\" \"))))","v":{"v":1.1,"d":"1.10"}},{"v":0.7,"d":"0.70"},{"$f":"Tabla1[[#This Row],[Ancho ]]*(Tabla1[[#This Row],[Altura ]]^2)*Tabla1[[#This Row],[Factor Hoja]]","v":{"v":14.15403,"d":"14.154"}},{"$f":"Tabla1[[#This Row],[Producción por ciclo ]]/(Tabla1[[#This Row],[Profundidad]]*Tabla1[[#This Row],[Ancho ]])","v":{"v":5.8736507936507945,"d":"5.87"}},{"$f":"MROUND(3*Tabla1[[#This Row],[Longitud ]],10)","v":{"v":20,"d":"20.00"}},{"$f":"Tabla1[[#This Row],[Producción por ciclo ]]/(Tabla1[[#This Row],[dmin]]*Tabla1[[#This Row],[Ancho ]])","v":{"v":0.166518,"d":"0.1665"}},{"$f":"IF(Tabla1[[#This Row],[Profundidad]]>Tabla1[[#This Row],[Profundidad de trabajo ]],\"Conforme\",\"No conforme\")","v":"Conforme"},{"$f":"Tabla1[[#This Row],[Densidad ]]*Tabla1[[#This Row],[Producción por ciclo ]]","v":{"v":23495.6898,"d":"23495.69"}},{"v":0.1,"d":"0.10"},{"$f":"Tabla1[[#This Row],[Peso ]]+Tabla1[[#This Row],[Peso de material]]","v":{"v":61415.6898,"d":"61415.69"}},{"$f":"(Tabla1[[#This Row],[Factor de tracción ]]*Tabla1[[#This Row],[Carga total]])/1000","v":{"v":42.990982859999995,"d":"42.99"}},1.15,{"v":1.5,"d":"1.50"},{"$f":"Tabla1[[#This Row],[dmin]]/(Tabla1[[#This Row],[Velod. Avance]]*1000/60)","v":{"v":1.0434782608695652,"d":"1.04"}},{"$f":"Tabla1[[#This Row],[dmin]]/(Tabla1[[#This Row],[Velod. Retroceso]]*1000/60)","v":{"v":0.8,"d":"0.80"}},{"$f":"Tabla1[[#This Row],[Power shift]]+Tabla1[[#This Row],[T. Avance]]+Tabla1[[#This Row],[T. Retroceso]]","v":{"v":1.9434782608695653,"d":"1.94"}},0.69,{"$f":"(Tabla1[[#This Row],[Producción por ciclo ]]*60*Tabla1[[#This Row],[Eficiencia]])/Tabla1[[#This Row],[Cm]]","v":{"v":301.5093370469798,"d":"301.51"}}]
["D8R",{"v":37920,"d":"37920.00"},"Universal ",{"v":6.79,"d":"6.790"},{"v":4.25,"d":"4.250"},{"v":1.74,"d":"1.740"},0.567,"Arena seca ",{"v":1420,"d":"1420.00"},"Empuje facil",{"$f":"IF(Tabla1[[#This Row],[Nivel de empuje]]=\"Empuje facil\",1.1,IF(Tabla1[[#This Row],[Nivel de empuje]]=\"Empuje promedio\",0.9,IF(Tabla1[[#This Row],[Nivel de empuje]]=\"Empuje medio dificultoso\",0.7,IF(Tabla1[[#This Row],[Nivel de empuje]]=\"Empuje dificultoso\",0.6,\" \"))))","v":{"v":1.1,"d":"1.10"}},0.39,{"$f":"Tabla1[[#This Row],[Ancho ]]*(Tabla1[[#This Row],[Altura ]]^2)*Tabla1[[#This Row],[Factor Hoja]]","v":{"v":14.15403,"d":"14.154"}},{"$f":"Tabla1[[#This Row],[Producción por ciclo ]]/(Tabla1[[#This Row],[Profundidad]]*Tabla1[[#This Row],[Ancho ]])","v":{"v":5.8736507936507945,"d":"5.87"}},{"$f":"MROUND(3*Tabla1[[#This Row],[Longitud ]],10)","v":{"v":20,"d":"20.00"}},{"$f":"Tabla1[[#This Row],[Producción por ciclo ]]/(Tabla1[[#This Row],[dmin]]*Tabla1[[#This Row],[Ancho ]])","v":{"v":0.166518,"d":"0.1665"}},{"$f":"IF(Tabla1[[#This Row],[Profundidad]]>Tabla1[[#This Row],[Profundidad de trabajo ]],\"Conforme\",\"No conforme\")","v":"Conforme"},{"$f":"Tabla1[[#This Row],[Densidad ]]*Tabla1[[#This Row],[Producción por ciclo ]]","v":{"v":20098.7226,"d":"20098.72"}},{"v":0.1,"d":"0.10"},{"$f":"Tabla1[[#This Row],[Peso ]]+Tabla1[[#This Row],[Peso de material]]","v":{"v":58018.7226,"d":"58018.72"}},{"$f":"(Tabla1[[#This Row],[Factor de tracción ]]*Tabla1[[#This Row],[Carga total]])/1000","v":{"v":22.627301814000003,"d":"22.63"}},{"v":2.5,"d":"2.50"},{"v":1.5,"d":"1.50"},{"$f":"Tabla1[[#This Row],[dmin]]/(Tabla1[[#This Row],[Velod. Avance]]*1000/60)","v":{"v":0.48000000000000004,"d":"0.48"}},{"$f":"Tabla1[[#This Row],[dmin]]/(Tabla1[[#This Row],[Velod. Retroceso]]*1000/60)","v":{"v":0.8,"d":"0.80"}},{"$f":"Tabla1[[#This Row],[Power shift]]+Tabla1[[#This Row],[T. Avance]]+Tabla1[[#This Row],[T. Retroceso]]","v":{"v":1.3800000000000001,"d":"1.38"}},0.69,{"$f":"(Tabla1[[#This Row],[Producción por ciclo ]]*60*Tabla1[[#This Row],[Eficiencia]])/Tabla1[[#This Row],[Cm]]","v":{"v":424.6208999999999,"d":"424.62"}}]
["D8R",{"v":37920,"d":"37920.00"},"Universal ",{"v":6.79,"d":"6.790"},{"v":4.25,"d":"4.250"},{"v":1.74,"d":"1.740"},0.567,"Arena húmeda ",{"v":1690,"d":"1690.00"},"Empuje medio dificultoso",{"$f":"IF(Tabla1[[#This Row],[Nivel de empuje]]=\"Empuje facil\",1.1,IF(Tabla1[[#This Row],[Nivel de empuje]]=\"Empuje promedio\",0.9,IF(Tabla1[[#This Row],[Nivel de empuje]]=\"Empuje medio dificultoso\",0.7,IF(Tabla1[[#This Row],[Nivel de empuje]]=\"Empuje dificultoso\",0.6,\" \"))))","v":{"v":0.7,"d":"0.70"}},{"v":0.5,"d":"0.50"},{"$f":"Tabla1[[#This Row],[Ancho ]]*(Tabla1[[#This Row],[Altura ]]^2)*Tabla1[[#This Row],[Factor Hoja]]","v":{"v":9.007109999999999,"d":"9.007"}},{"$f":"Tabla1[[#This Row],[Producción por ciclo ]]/(Tabla1[[#This Row],[Profundidad]]*Tabla1[[#This Row],[Ancho ]])","v":{"v":3.7377777777777776,"d":"3.74"}},{"$f":"MROUND(3*Tabla1[[#This Row],[Longitud ]],10)","v":{"v":20,"d":"20.00"}},{"$f":"Tabla1[[#This Row],[Producción por ciclo ]]/(Tabla1[[#This Row],[dmin]]*Tabla1[[#This Row],[Ancho ]])","v":{"v":0.10596599999999999,"d":"0.1060"}},{"$f":"IF(Tabla1[[#This Row],[Profundidad]]>Tabla1[[#This Row],[Profundidad de trabajo ]],\"Conforme\",\"No conforme\")","v":"Conforme"},{"$f":"Tabla1[[#This Row],[Densidad ]]*Tabla1[[#This Row],[Producción por ciclo ]]","v":{"v":15222.015899999999,"d":"15222.02"}},{"v":0.1,"d":"0.10"},{"$f":"Tabla1[[#This Row],[Peso ]]+Tabla1[[#This Row],[Peso de material]]","v":{"v":53142.0159,"d":"53142.02"}},{"$f":"(Tabla1[[#This Row],[Factor de tracción ]]*Tabla1[[#This Row],[Carga total]])/1000","v":{"v":26.57100795,"d":"26.57"}},{"v":2.2,"d":"2.20"},{"v":1.5,"d":"1.50"},{"$f":"Tabla1[[#This Row],[dmin]]/(Tabla1[[#This Row],[Velod. Avance]]*1000/60)","v":{"v":0.5454545454545455,"d":"0.55"}},{"$f":"Tabla1[[#This Row],[dmin]]/(Tabla1[[#This Row],[Velod. Retroceso]]*1000/60)","v":{"v":0.8,"d":"0.80"}},{"$f":"Tabla1[[#This Row],[Power shift]]+Tabla1[[#This Row],[T. Avance]]+Tabla1[[#This Row],[T. Retroceso]]","v":{"v":1.4454545454545455,"d":"1.45"}},0.69,{"$f":"(Tabla1[[#This Row],[Producción por ciclo ]]*60*Tabla1[[#This Row],[Eficiencia]])/Tabla1[[#This Row],[Cm]]","v":{"v":257.97722603773576,"d":"257.98"}}]
["D8R",{"v":37920,"d":"37920.00"},"Universal ",{"v":6.79,"d":"6.790"},{"v":4.25,"d":"4.250"},{"v":1.74,"d":"1.740"},0.567,"Grava suelta ",{"v":1930,"d":"1930.00"},"Empuje promedio",{"$f":"IF(Tabla1[[#This Row],[Nivel de empuje]]=\"Empuje facil\",1.1,IF(Tabla1[[#This Row],[Nivel de empuje]]=\"Empuje promedio\",0.9,IF(Tabla1[[#This Row],[Nivel de empuje]]=\"Empuje medio dificultoso\",0.7,IF(Tabla1[[#This Row],[Nivel de empuje]]=\"Empuje dificultoso\",0.6,\" \"))))","v":{"v":0.9,"d":"0.90"}},{"v":0.5,"d":"0.50"},{"$f":"Tabla1[[#This Row],[Ancho ]]*(Tabla1[[#This Row],[Altura ]]^2)*Tabla1[[#This Row],[Factor Hoja]]","v":{"v":11.58057,"d":"11.581"}},{"$f":"Tabla1[[#This Row],[Producción por ciclo ]]/(Tabla1[[#This Row],[Profundidad]]*Tabla1[[#This Row],[Ancho ]])","v":{"v":4.805714285714286,"d":"4.81"}},{"$f":"MROUND(3*Tabla1[[#This Row],[Longitud ]],10)","v":{"v":20,"d":"20.00"}},{"$f":"Tabla1[[#This Row],[Producción por ciclo ]]/(Tabla1[[#This Row],[dmin]]*Tabla1[[#This Row],[Ancho ]])","v":{"v":0.136242,"d":"0.1362"}},{"$f":"IF(Tabla1[[#This Row],[Profundidad]]>Tabla1[[#This Row],[Profundidad de trabajo ]],\"Conforme\",\"No conforme\")","v":"Conforme"},{"$f":"Tabla1[[#This Row],[Densidad ]]*Tabla1[[#This Row],[Producción por ciclo ]]","v":{"v":22350.5001,"d":"22350.50"}},{"v":0.1,"d":"0.10"},{"$f":"Tabla1[[#This Row],[Peso ]]+Tabla1[[#This Row],[Peso de material]]","v":{"v":60270.500100000005,"d":"60270.50"}},{"$f":"(Tabla1[[#This Row],[Factor de tracción ]]*Tabla1[[#This Row],[Carga total]])/1000","v":{"v":30.135250050000003,"d":"30.14"}},1.99,{"v":1.5,"d":"1.50"},{"$f":"Tabla1[[#This Row],[dmin]]/(Tabla1[[#This Row],[Velod. Avance]]*1000/60)","v":{"v":0.6030150753768845,"d":"0.60"}},{"$f":"Tabla1[[#This Row],[dmin]]/(Tabla1[[#This Row],[Velod. Retroceso]]*1000/60)","v":{"v":0.8,"d":"0.80"}},{"$f":"Tabla1[[#This Row],[Power shift]]+Tabla1[[#This Row],[T. Avance]]+Tabla1[[#This Row],[T. Retroceso]]","v":{"v":1.5030150753768845,"d":"1.50"}},0.69,{"$f":"(Tabla1[[#This Row],[Producción por ciclo ]]*60*Tabla1[[#This Row],[Eficiencia]])/Tabla1[[#This Row],[Cm]]","v":{"v":318.9825610230692,"d":"318.98"}}]
["D8R",{"v":37920,"d":"37920.00"},"Universal ",{"v":6.79,"d":"6.790"},{"v":4.25,"d":"4.250"},{"v":1.74,"d":"1.740"},0.567,"Nieve compacta",{"v":130,"d":"130.00"},"Empuje medio dificultoso",{"$f":"IF(Tabla1[[#This Row],[Nivel de empuje]]=\"Empuje facil\",1.1,IF(Tabla1[[#This Row],[Nivel de empuje]]=\"Empuje promedio\",0.9,IF(Tabla1[[#This Row],[Nivel de empuje]]=\"Empuje medio dificultoso\",0.7,IF(Tabla1[[#This Row],[Nivel de empuje]]=\"Empuje dificultoso\",0.6,\" \"))))","v":{"v":0.7,"d":"0.70"}},0.27,{"$f":"Tabla1[[#This Row],[Ancho ]]*(Tabla1[[#This Row],[Altura ]]^2)*Tabla1[[#This Row],[Factor Hoja]]","v":{"v":9.007109999999999,"d":"9.007"}},{"$f":"Tabla1[[#This Row],[Producción por ciclo ]]/(Tabla1[[#This Row],[Profundidad]]*Tabla1[[#This Row],[Ancho ]])","v":{"v":3.7377777777777776,"d":"3.74"}},{"$f":"MROUND(3*Tabla1[[#This Row],[Longitud ]],10)","v":{"v":20,"d":"20.00"}},{"$f":"Tabla1[[#This Row],[Producción por ciclo ]]/(Tabla1[[#This Row],[dmin]]*Tabla1[[#This Row],[Ancho ]])","v":{"v":0.10596599999999999,"d":"0.1060"}},{"$f":"IF(Tabla1[[#This Row],[Profundidad]]>Tabla1[[#This Row],[Profundidad de trabajo ]],\"Conforme\",\"No conforme\")","v":"Conforme"},{"$f":"Tabla1[[#This Row],[Densidad ]]*Tabla1[[#This Row],[Producción por ciclo ]]","v":{"v":1170.9243,"d":"1170.92"}},{"v":0.1,"d":"0.10"},{"$f":"Tabla1[[#This Row],[Peso ]]+Tabla1[[#This Row],[Peso de material]]","v":{"v":39090.9243,"d":"39090.92"}},{"$f":"(Tabla1[[#This Row],[Factor de tracción ]]*Tabla1[[#This Row],[Carga total]])/1000","v":{"v":10.554549561,"d":"10.55"}},4.76,{"v":1.5,"d":"1.50"},{"$f":"Tabla1[[#This Row],[dmin]]/(Tabla1[[#This Row],[Velod. Avance]]*1000/60)","v":{"v":0.25210084033613445,"d":"0.25"}},{"$f":"Tabla1[[#This Row],[dmin]]/(Tabla1[[#This Row],[Velod. Retroceso]]*1000/60)","v":{"v":0.8,"d":"0.80"}},{"$f":"Tabla1[[#This Row],[Power shift]]+Tabla1[[#This Row],[T. Avance]]+Tabla1[[#This Row],[T. Retroceso]]","v":{"v":1.1521008403361344,"d":"1.15"}},0.69,{"$f":"(Tabla1[[#This Row],[Producción por ciclo ]]*60*Tabla1[[#This Row],[Eficiencia]])/Tabla1[[#This Row],[Cm]]","v":{"v":323.66468363238505,"d":"323.66"}}]
["D8R",{"v":37920,"d":"37920.00"},"Universal ",{"v":6.79,"d":"6.790"},{"v":4.25,"d":"4.250"},{"v":1.74,"d":"1.740"},0.567,"Hielo ",{"v":520,"d":"520.00"},"Empuje dificultoso",{"$f":"IF(Tabla1[[#This Row],[Nivel de empuje]]=\"Empuje facil\",1.1,IF(Tabla1[[#This Row],[Nivel de empuje]]=\"Empuje promedio\",0.9,IF(Tabla1[[#This Row],[Nivel de empuje]]=\"Empuje medio dificultoso\",0.7,IF(Tabla1[[#This Row],[Nivel de empuje]]=\"Empuje dificultoso\",0.6,\" \"))))","v":{"v":0.6,"d":"0.60"}},0.12,{"$f":"Tabla1[[#This Row],[Ancho ]]*(Tabla1[[#This Row],[Altura ]]^2)*Tabla1[[#This Row],[Factor Hoja]]","v":{"v":7.72038,"d":"7.720"}},{"$f":"Tabla1[[#This Row],[Producción por ciclo ]]/(Tabla1[[#This Row],[Profundidad]]*Tabla1[[#This Row],[Ancho ]])","v":{"v":3.203809523809524,"d":"3.20"}},{"$f":"MROUND(3*Tabla1[[#This Row],[Longitud ]],10)","v":{"v":20,"d":"20.00"}},{"$f":"Tabla1[[#This Row],[Producción por ciclo ]]/(Tabla1[[#This Row],[dmin]]*Tabla1[[#This Row],[Ancho ]])","v":{"v":0.09082799999999999,"d":"0.0908"}},{"$f":"IF(Tabla1[[#This Row],[Profundidad]]>Tabla1[[#This Row],[Profundidad de trabajo ]],\"Conforme\",\"No conforme\")","v":"Conforme"},{"$f":"Tabla1[[#This Row],[Densidad ]]*Tabla1[[#This Row],[Producción por ciclo ]]","v":{"v":4014.5975999999996,"d":"4014.60"}},{"v":0.1,"d":"0.10"},{"$f":"Tabla1[[#This Row],[Peso ]]+Tabla1[[#This Row],[Peso de material]]","v":{"v":41934.5976,"d":"41934.60"}},{"$f":"(Tabla1[[#This Row],[Factor de tracción ]]*Tabla1[[#This Row],[Carga total]])/1000","v":{"v":5.032151712,"d":"5.03"}},8.94,{"v":1.5,"d":"1.50"},{"$f":"Tabla1[[#This Row],[dmin]]/(Tabla1[[#This Row],[Velod. Avance]]*1000/60)","v":{"v":0.1342281879194631,"d":"0.13"}},{"$f":"Tabla1[[#This Row],[dmin]]/(Tabla1[[#This Row],[Velod. Retroceso]]*1000/60)","v":{"v":0.8,"d":"0.80"}},{"$f":"Tabla1[[#This Row],[Power shift]]+Tabla1[[#This Row],[T. Avance]]+Tabla1[[#This Row],[T. Retroceso]]","v":{"v":1.0342281879194632,"d":"1.03"}},0.69,{"$f":"(Tabla1[[#This Row],[Producción por ciclo ]]*60*Tabla1[[#This Row],[Eficiencia]])/Tabla1[[#This Row],[Cm]]","v":{"v":309.0456591044775,"d":"309.05"}}]
["D8R",{"v":37920,"d":"37920.00"},"Universal ",{"v":6.79,"d":"6.790"},{"v":4.25,"d":"4.250"},{"v":1.74,"d":"1.740"},0.567,"Tierra firme ",{"v":1510,"d":"1510.00"},"Empuje facil",{"$f":"IF(Tabla1[[#This Row],[Nivel de empuje]]=\"Empuje facil\",1.1,IF(Tabla1[[#This Row],[Nivel de empuje]]=\"Empuje promedio\",0.9,IF(Tabla1[[#This Row],[Nivel de empuje]]=\"Empuje medio dificultoso\",0.7,IF(Tabla1[[#This Row],[Nivel de empuje]]=\"Empuje dificultoso\",0.6,\" \"))))","v":{"v":1.1,"d":"1.10"}},{"v":0.9,"d":"0.90"},{"$f":"Tabla1[[#This Row],[Ancho ]]*(Tabla1[[#This Row],[Altura ]]^2)*Tabla1[[#This Row],[Factor Hoja]]","v":{"v":14.15403,"d":"14.154"}},{"$f":"Tabla1[[#This Row],[Producción por ciclo ]]/(Tabla1[[#This Row],[Profundidad]]*Tabla1[[#This Row],[Ancho ]])","v":{"v":5.8736507936507945,"d":"5.87"}},{"$f":"MROUND(3*Tabla1[[#This Row],[Longitud ]],10)","v":{"v":20,"d":"20.00"}},{"$f":"Tabla1[[#This Row],[Producción por ciclo ]]/(Tabla1[[#This Row],[dmin]]*Tabla1[[#This Row],[Ancho ]])","v":{"v":0.166518,"d":"0.1665"}},{"$f":"IF(Tabla1[[#This Row],[Profundidad]]>Tabla1[[#This Row],[Profundidad de trabajo ]],\"Conforme\",\"No conforme\")","v":"Conforme"},{"$f":"Tabla1[[#This Row],[Densidad ]]*Tabla1[[#This Row],[Producción por ciclo ]]","v":{"v":21372.585300000002,"d":"21372.59"}},{"v":0.1,"d":"0.10"},{"$f":"Tabla1[[#This Row],[Peso ]]+Tabla1[[#This Row],[Peso de material]]","v":{"v":59292.585300000006,"d":"59292.59"}},{"$f":"(Tabla1[[#This Row],[Factor de tracción ]]*Tabla1[[#This Row],[Carga total]])/1000","v":{"v":53.36332677000001,"d":"53.36"}},0.38,{"v":1.5,"d":"1.50"},{"$f":"Tabla1[[#This Row],[dmin]]/(Tabla1[[#This Row],[Velod. Avance]]*1000/60)","v":{"v":3.1578947368421053,"d":"3.16"}},{"$f":"Tabla1[[#This Row],[dmin]]/(Tabla1[[#This Row],[Velod. Retroceso]]*1000/60)","v":{"v":0.8,"d":"0.80"}},{"$f":"Tabla1[[#This Row],[Power shift]]+Tabla1[[#This Row],[T. Avance]]+Tabla1[[#This Row],[T. Retroceso]]","v":{"v":4.057894736842106,"d":"4.06"}},0.69,{"$f":"(Tabla1[[#This Row],[Producción por ciclo ]]*60*Tabla1[[#This Row],[Eficiencia]])/Tabla1[[#This Row],[Cm]]","v":{"v":144.40415042801553,"d":"144.40"}}]
["D8R",{"v":37920,"d":"37920.00"},"Universal ",{"v":6.79,"d":"6.790"},{"v":4.25,"d":"4.250"},{"v":1.74,"d":"1.740"},0.567,"Tierra suelta ",{"v":1250,"d":"1250.00"},"Empuje facil",{"$f":"IF(Tabla1[[#This Row],[Nivel de empuje]]=\"Empuje facil\",1.1,IF(Tabla1[[#This Row],[Nivel de empuje]]=\"Empuje promedio\",0.9,IF(Tabla1[[#This Row],[Nivel de empuje]]=\"Empuje medio dificultoso\",0.7,IF(Tabla1[[#This Row],[Nivel de empuje]]=\"Empuje dificultoso\",0.6,\" \"))))","v":{"v":1.1,"d":"1.10"}},{"v":0.6,"d":"0.60"},{"$f":"Tabla1[[#This Row],[Ancho ]]*(Tabla1[[#This Row],[Altura ]]^2)*Tabla1[[#This Row],[Factor Hoja]]","v":{"v":14.15403,"d":"14.154"}},{"$f":"Tabla1[[#This Row],[Producción por ciclo ]]/(Tabla1[[#This Row],[Profundidad]]*Tabla1[[#This Row],[Ancho ]])","v":{"v":5.8736507936507945,"d":"5.87"}},{"$f":"MROUND(3*Tabla1[[#This Row],[Longitud ]],10)","v":{"v":20,"d":"20.00"}},{"$f":"Tabla1[[#This Row],[Producción por ciclo ]]/(Tabla1[[#This Row],[dmin]]*Tabla1[[#This Row],[Ancho ]])","v":{"v":0.166518,"d":"0.1665"}},{"$f":"IF(Tabla1[[#This Row],[Profundidad]]>Tabla1[[#This Row],[Profundidad de trabajo ]],\"Conforme\",\"No conforme\")","v":"Conforme"},{"$f":"Tabla1[[#This Row],[Densidad ]]*Tabla1[[#This Row],[Producción por ciclo ]]","v":{"v":17692.537500000002,"d":"17692.54"}},{"v":0.1,"d":"0.10"},{"$f":"Tabla1[[#This Row],[Peso ]]+Tabla1[[#This Row],[Peso de material]]","v":{"v":55612.537500000006,"d":"55612.54"}},{"$f":"(Tabla1[[#This Row],[Factor de tracción ]]*Tabla1[[#This Row],[Carga total]])/1000","v":{"v":33.3675225,"d":"33.37"}},1.76,{"v":1.5,"d":"1.50"},{"$f":"Tabla1[[#This Row],[dmin]]/(Tabla1[[#This Row],[Velod. Avance]]*1000/60)","v":{"v":0.6818181818181819,"d":"0.68"}},{"$f":"Tabla1[[#This Row],[dmin]]/(Tabla1[[#This Row],[Velod. Retroceso]]*1000/60)","v":{"v":0.8,"d":"0.80"}},{"$f":"Tabla1[[#This Row],[Power shift]]+Tabla1[[#This Row],[T. Avance]]+Tabla1[[#This Row],[T. Retroceso]]","v":{"v":1.581818181818182,"d":"1.58"}},0.69,{"$f":"(Tabla1[[#This Row],[Producción por ciclo ]]*60*Tabla1[[#This Row],[Eficiencia]])/Tabla1[[#This Row],[Cm]]","v":{"v":370.4451299999999,"d":"370.45"}}]
["D8R",{"v":37920,"d":"37920.00"},"Universal ",{"v":6.79,"d":"6.790"},{"v":4.25,"d":"4.250"},{"v":1.74,"d":"1.740"},0.567,"Carbón ",{"v":1190,"d":"1190.00"},"Empuje promedio",{"$f":"IF(Tabla1[[#This Row],[Nivel de empuje]]=\"Empuje facil\",1.1,IF(Tabla1[[#This Row],[Nivel de empuje]]=\"Empuje promedio\",0.9,IF(Tabla1[[#This Row],[Nivel de empuje]]=\"Empuje medio dificultoso\",0.7,IF(Tabla1[[#This Row],[Nivel de empuje]]=\"Empuje dificultoso\",0.6,\" \"))))","v":{"v":0.9,"d":"0.90"}},{"v":0.6,"d":"0.60"},{"$f":"Tabla1[[#This Row],[Ancho ]]*(Tabla1[[#This Row],[Altura ]]^2)*Tabla1[[#This Row],[Factor Hoja]]","v":{"v":11.58057,"d":"11.581"}},{"$f":"Tabla1[[#This Row],[Producción por ciclo ]]/(Tabla1[[#This Row],[Profundidad]]*Tabla1[[#This Row],[Ancho ]])","v":{"v":4.805714285714286,"d":"4.81"}},{"$f":"MROUND(3*Tabla1[[#This Row],[Longitud ]],10)","v":{"v":20,"d":"20.00"}},{"$f":"Tabla1[[#This Row],[Producción por ciclo ]]/(Tabla1[[#This Row],[dmin]]*Tabla1[[#This Row],[Ancho ]])","v":{"v":0.136242,"d":"0.1362"}},{"$f":"IF(Tabla1[[#This Row],[Profundidad]]>Tabla1[[#This Row],[Profundidad de trabajo ]],\"Conforme\",\"No conforme\")","v":"Conforme"},{"$f":"Tabla1[[#This Row],[Densidad ]]*Tabla1[[#This Row],[Producción por ciclo ]]","v":{"v":13780.8783,"d":"13780.88"}},{"v":0.1,"d":"0.10"},{"$f":"Tabla1[[#This Row],[Peso ]]+Tabla1[[#This Row],[Peso de material]]","v":{"v":51700.8783,"d":"51700.88"}},{"$f":"(Tabla1[[#This Row],[Factor de tracción ]]*Tabla1[[#This Row],[Carga total]])/1000","v":{"v":31.020526979999996,"d":"31.02"}},{"v":1.9,"d":"1.90"},{"v":1.5,"d":"1.50"},{"$f":"Tabla1[[#This Row],[dmin]]/(Tabla1[[#This Row],[Velod. Avance]]*1000/60)","v":{"v":0.631578947368421,"d":"0.63"}},{"$f":"Tabla1[[#This Row],[dmin]]/(Tabla1[[#This Row],[Velod. Retroceso]]*1000/60)","v":{"v":0.8,"d":"0.80"}},{"$f":"Tabla1[[#This Row],[Power shift]]+Tabla1[[#This Row],[T. Avance]]+Tabla1[[#This Row],[T. Retroceso]]","v":{"v":1.5315789473684212,"d":"1.53"}},0.69,{"$f":"(Tabla1[[#This Row],[Producción por ciclo ]]*60*Tabla1[[#This Row],[Eficiencia]])/Tabla1[[#This Row],[Cm]]","v":{"v":313.03355195876287,"d":"313.03"}}]
["D8T ",{"v":39751,"d":"39751.00"},"Orientación",{"v":6.57,"d":"6.570"},{"v":5,"d":"5.000"},1.174,0.625,"Concreto ",{"v":2400,"d":"2400.00"},"Empuje dificultoso",{"$f":"IF(Tabla1[[#This Row],[Nivel de empuje]]=\"Empuje facil\",1.1,IF(Tabla1[[#This Row],[Nivel de empuje]]=\"Empuje promedio\",0.9,IF(Tabla1[[#This Row],[Nivel de empuje]]=\"Empuje medio dificultoso\",0.7,IF(Tabla1[[#This Row],[Nivel de empuje]]=\"Empuje dificultoso\",0.6,\" \"))))","v":{"v":0.6,"d":"0.60"}},0.45,{"$f":"Tabla1[[#This Row],[Ancho ]]*(Tabla1[[#This Row],[Altura ]]^2)*Tabla1[[#This Row],[Factor Hoja]]","v":{"v":4.134827999999999,"d":"4.135"}},{"$f":"Tabla1[[#This Row],[Producción por ciclo ]]/(Tabla1[[#This Row],[Profundidad]]*Tabla1[[#This Row],[Ancho ]])","v":{"v":1.3231449599999996,"d":"1.32"}},{"$f":"MROUND(3*Tabla1[[#This Row],[Longitud ]],10)","v":{"v":20,"d":"20.00"}},{"$f":"Tabla1[[#This Row],[Producción por ciclo ]]/(Tabla1[[#This Row],[dmin]]*Tabla1[[#This Row],[Ancho ]])","v":{"v":0.04134827999999999,"d":"0.0413"}},{"$f":"IF(Tabla1[[#This Row],[Profundidad]]>Tabla1[[#This Row],[Profundidad de trabajo ]],\"Conforme\",\"No conforme\")","v":"Conforme"},{"$f":"Tabla1[[#This Row],[Densidad ]]*Tabla1[[#This Row],[Producción por ciclo ]]","v":{"v":9923.587199999998,"d":"9923.59"}},{"v":0.1,"d":"0.10"},{"$f":"Tabla1[[#This Row],[Peso ]]+Tabla1[[#This Row],[Peso de material]]","v":{"v":49674.587199999994,"d":"49674.59"}},{"$f":"(Tabla1[[#This Row],[Factor de tracción ]]*Tabla1[[#This Row],[Carga total]])/1000","v":{"v":22.35356424,"d":"22.35"}},2.51,{"v":1.3,"d":"1.30"},{"$f":"Tabla1[[#This Row],[dmin]]/(Tabla1[[#This Row],[Velod. Avance]]*1000/60)","v":{"v":0.4780876494023904,"d":"0.48"}},{"$f":"Tabla1[[#This Row],[dmin]]/(Tabla1[[#This Row],[Velod. Retroceso]]*1000/60)","v":{"v":0.923076923076923,"d":"0.92"}},{"$f":"Tabla1[[#This Row],[Power shift]]+Tabla1[[#This Row],[T. Avance]]+Tabla1[[#This Row],[T. Retroceso]]","v":{"v":1.5011645724793135,"d":"1.50"}},0.69,{"$f":"(Tabla1[[#This Row],[Producción por ciclo ]]*60*Tabla1[[#This Row],[Eficiencia]])/Tabla1[[#This Row],[Cm]]","v":{"v":114.03271988845106,"d":"114.03"}}]
["D8T ",{"v":39751,"d":"39751.00"},"Orientación",{"v":6.57,"d":"6.570"},{"v":5,"d":"5.000"},1.174,0.625,"Arcilla seca ",{"v":1480,"d":"1480.00"},"Empuje medio dificultoso",{"$f":"IF(Tabla1[[#This Row],[Nivel de empuje]]=\"Empuje facil\",1.1,IF(Tabla1[[#This Row],[Nivel de empuje]]=\"Empuje promedio\",0.9,IF(Tabla1[[#This Row],[Nivel de empuje]]=\"Empuje medio dificultoso\",0.7,IF(Tabla1[[#This Row],[Nivel de empuje]]=\"Empuje dificultoso\",0.6,\" \"))))","v":{"v":0.7,"d":"0.70"}},{"v":0.9,"d":"0.90"},{"$f":"Tabla1[[#This Row],[Ancho ]]*(Tabla1[[#This Row],[Altura ]]^2)*Tabla1[[#This Row],[Factor Hoja]]","v":{"v":4.823965999999999,"d":"4.824"}},{"$f":"Tabla1[[#This Row],[Producción por ciclo ]]/(Tabla1[[#This Row],[Profundidad]]*Tabla1[[#This Row],[Ancho ]])","v":{"v":1.5436691199999997,"d":"1.54"}},{"$f":"MROUND(3*Tabla1[[#This Row],[Longitud ]],10)","v":{"v":20,"d":"20.00"}},{"$f":"Tabla1[[#This Row],[Producción por ciclo ]]/(Tabla1[[#This Row],[dmin]]*Tabla1[[#This Row],[Ancho ]])","v":{"v":0.04823965999999999,"d":"0.0482"}},{"$f":"IF(Tabla1[[#This Row],[Profundidad]]>Tabla1[[#This Row],[Profundidad de trabajo ]],\"Conforme\",\"No conforme\")","v":"Conforme"},{"$f":"Tabla1[[#This Row],[Densidad ]]*Tabla1[[#This Row],[Producción por ciclo ]]","v":{"v":7139.469679999998,"d":"7139.47"}},{"v":0.1,"d":"0.10"},{"$f":"Tabla1[[#This Row],[Peso ]]+Tabla1[[#This Row],[Peso de material]]","v":{"v":46890.469679999995,"d":"46890.47"}},{"$f":"(Tabla1[[#This Row],[Factor de tracción ]]*Tabla1[[#This Row],[Carga total]])/1000","v":{"v":42.201422712,"d":"42.20"}},{"v":1.1,"d":"1.10"},{"v":1.3,"d":"1.30"},{"$f":"Tabla1[[#This Row],[dmin]]/(Tabla1[[#This Row],[Velod. Avance]]*1000/60)","v":{"v":1.090909090909091,"d":"1.09"}},{"$f":"Tabla1[[#This Row],[dmin]]/(Tabla1[[#This Row],[Velod. Retroceso]]*1000/60)","v":{"v":0.923076923076923,"d":"0.92"}},{"$f":"Tabla1[[#This Row],[Power shift]]+Tabla1[[#This Row],[T. Avance]]+Tabla1[[#This Row],[T. Retroceso]]","v":{"v":2.1139860139860143,"d":"2.11"}},0.69,{"$f":"(Tabla1[[#This Row],[Producción por ciclo ]]*60*Tabla1[[#This Row],[Eficiencia]])/Tabla1[[#This Row],[Cm]]","v":{"v":94.47186077803502,"d":"94.47"}}]
["D8T ",{"v":39751,"d":"39751.00"},"Orientación",{"v":6.57,"d":"6.570"},{"v":5,"d":"5.000"},1.174,0.625,"Arcilla húmeda",{"v":1660,"d":"1660.00"},"Empuje facil",{"$f":"IF(Tabla1[[#This Row],[Nivel de empuje]]=\"Empuje facil\",1.1,IF(Tabla1[[#This Row],[Nivel de empuje]]=\"Empuje promedio\",0.9,IF(Tabla1[[#This Row],[Nivel de empuje]]=\"Empuje medio dificultoso\",0.7,IF(Tabla1[[#This Row],[Nivel de empuje]]=\"Empuje dificultoso\",0.6,\" \"))))","v":{"v":1.1,"d":"1.10"}},{"v":0.7,"d":"0.70"},{"$f":"Tabla1[[#This Row],[Ancho ]]*(Tabla1[[#This Row],[Altura ]]^2)*Tabla1[[#This Row],[Factor Hoja]]","v":{"v":7.580518,"d":"7.581"}},{"$f":"Tabla1[[#This Row],[Producción por ciclo ]]/(Tabla1[[#This Row],[Profundidad]]*Tabla1[[#This Row],[Ancho ]])","v":{"v":2.42576576,"d":"2.43"}},{"$f":"MROUND(3*Tabla1[[#This Row],[Longitud ]],10)","v":{"v":20,"d":"20.00"}},{"$f":"Tabla1[[#This Row],[Producción por ciclo ]]/(Tabla1[[#This Row],[dmin]]*Tabla1[[#This Row],[Ancho ]])","v":{"v":0.07580518,"d":"0.0758"}},{"$f":"IF(Tabla1[[#This Row],[Profundidad]]>Tabla1[[#This Row],[Profundidad de trabajo ]],\"Conforme\",\"No conforme\")","v":"Conforme"},{"$f":"Tabla1[[#This Row],[Densidad ]]*Tabla1[[#This Row],[Producción por ciclo ]]","v":{"v":12583.65988,"d":"12583.66"}},{"v":0.1,"d":"0.10"},{"$f":"Tabla1[[#This Row],[Peso ]]+Tabla1[[#This Row],[Peso de material]]","v":{"v":52334.65988,"d":"52334.66"}},{"$f":"(Tabla1[[#This Row],[Factor de tracción ]]*Tabla1[[#This Row],[Carga total]])/1000","v":{"v":36.63426191599999,"d":"36.63"}},1.45,{"v":1.3,"d":"1.30"},{"$f":"Tabla1[[#This Row],[dmin]]/(Tabla1[[#This Row],[Velod. Avance]]*1000/60)","v":{"v":0.8275862068965517,"d":"0.83"}},{"$f":"Tabla1[[#This Row],[dmin]]/(Tabla1[[#This Row],[Velod. Retroceso]]*1000/60)","v":{"v":0.923076923076923,"d":"0.92"}},{"$f":"Tabla1[[#This Row],[Power shift]]+Tabla1[[#This Row],[T. Avance]]+Tabla1[[#This Row],[T. Retroceso]]","v":{"v":1.8506631299734746,"d":"1.85"}},0.69,{"$f":"(Tabla1[[#This Row],[Producción por ciclo ]]*60*Tabla1[[#This Row],[Eficiencia]])/Tabla1[[#This Row],[Cm]]","v":{"v":169.57891477769815,"d":"169.58"}}]
["D8T ",{"v":39751,"d":"39751.00"},"Orientación",{"v":6.57,"d":"6.570"},{"v":5,"d":"5.000"},1.174,0.625,"Arena seca ",{"v":1420,"d":"1420.00"},"Empuje facil",{"$f":"IF(Tabla1[[#This Row],[Nivel de empuje]]=\"Empuje facil\",1.1,IF(Tabla1[[#This Row],[Nivel de empuje]]=\"Empuje promedio\",0.9,IF(Tabla1[[#This Row],[Nivel de empuje]]=\"Empuje medio dificultoso\",0.7,IF(Tabla1[[#This Row],[Nivel de empuje]]=\"Empuje dificultoso\",0.6,\" \"))))","v":{"v":1.1,"d":"1.10"}},0.39,{"$f":"Tabla1[[#This Row],[Ancho ]]*(Tabla1[[#This Row],[Altura ]]^2)*Tabla1[[#This Row],[Factor Hoja]]","v":{"v":7.580518,"d":"7.581"}},{"$f":"Tabla1[[#This Row],[Producción por ciclo ]]/(Tabla1[[#This Row],[Profundidad]]*Tabla1[[#This Row],[Ancho ]])","v":{"v":2.42576576,"d":"2.43"}},{"$f":"MROUND(3*Tabla1[[#This Row],[Longitud ]],10)","v":{"v":20,"d":"20.00"}},{"$f":"Tabla1[[#This Row],[Producción por ciclo ]]/(Tabla1[[#This Row],[dmin]]*Tabla1[[#This Row],[Ancho ]])","v":{"v":0.07580518,"d":"0.0758"}},{"$f":"IF(Tabla1[[#This Row],[Profundidad]]>Tabla1[[#This Row],[Profundidad de trabajo ]],\"Conforme\",\"No conforme\")","v":"Conforme"},{"$f":"Tabla1[[#This Row],[Densidad ]]*Tabla1[[#This Row],[Producción por ciclo ]]","v":{"v":10764.33556,"d":"10764.34"}},{"v":0.1,"d":"0.10"},{"$f":"Tabla1[[#This Row],[Peso ]]+Tabla1[[#This Row],[Peso de material]]","v":{"v":50515.33556,"d":"50515.34"}},{"$f":"(Tabla1[[#This Row],[Factor de tracción ]]*Tabla1[[#This Row],[Carga total]])/1000","v":{"v":19.700980868400002,"d":"19.70"}},2.51,{"v":1.3,"d":"1.30"},{"$f":"Tabla1[[#This Row],[dmin]]/(Tabla1[[#This Row],[Velod. Avance]]*1000/60)","v":{"v":0.4780876494023904,"d":"0.48"}},{"$f":"Tabla1[[#This Row],[dmin]]/(Tabla1[[#This Row],[Velod. Retroceso]]*1000/60)","v":{"v":0.923076923076923,"d":"0.92"}},{"$f":"Tabla1[[#This Row],[Power shift]]+Tabla1[[#This Row],[T. Avance]]+Tabla1[[#This Row],[T. Retroceso]]","v":{"v":1.5011645724793135,"d":"1.50"}},0.69,{"$f":"(Tabla1[[#This Row],[Producción por ciclo ]]*60*Tabla1[[#This Row],[Eficiencia]])/Tabla1[[#This Row],[Cm]]","v":{"v":209.05998646216034,"d":"209.06"}}]
["D8T ",{"v":39751,"d":"39751.00"},"Orientación",{"v":6.57,"d":"6.570"},{"v":5,"d":"5.000"},1.174,0.625,"Arena húmeda ",{"v":1690,"d":"1690.00"},"Empuje medio dificultoso",{"$f":"IF(Tabla1[[#This Row],[Nivel de empuje]]=\"Empuje facil\",1.1,IF(Tabla1[[#This Row],[Nivel de empuje]]=\"Empuje promedio\",0.9,IF(Tabla1[[#This Row],[Nivel de empuje]]=\"Empuje medio dificultoso\",0.7,IF(Tabla1[[#This Row],[Nivel de empuje]]=\"Empuje dificultoso\",0.6,\" \"))))","v":{"v":0.7,"d":"0.70"}},{"v":0.5,"d":"0.50"},{"$f":"Tabla1[[#This Row],[Ancho ]]*(Tabla1[[#This Row],[Altura ]]^2)*Tabla1[[#This Row],[Factor Hoja]]","v":{"v":4.823965999999999,"d":"4.824"}},{"$f":"Tabla1[[#This Row],[Producción por ciclo ]]/(Tabla1[[#This Row],[Profundidad]]*Tabla1[[#This Row],[Ancho ]])","v":{"v":1.5436691199999997,"d":"1.54"}},{"$f":"MROUND(3*Tabla1[[#This Row],[Longitud ]],10)","v":{"v":20,"d":"20.00"}},{"$f":"Tabla1[[#This Row],[Producción por ciclo ]]/(Tabla1[[#This Row],[dmin]]*Tabla1[[#This Row],[Ancho ]])","v":{"v":0.04823965999999999,"d":"0.0482"}},{"$f":"IF(Tabla1[[#This Row],[Profundidad]]>Tabla1[[#This Row],[Profundidad de trabajo ]],\"Conforme\",\"No conforme\")","v":"Conforme"},{"$f":"Tabla1[[#This Row],[Densidad ]]*Tabla1[[#This Row],[Producción por ciclo ]]","v":{"v":8152.502539999998,"d":"8152.50"}},{"v":0.1,"d":"0.10"},{"$f":"Tabla1[[#This Row],[Peso ]]+Tabla1[[#This Row],[Peso de material]]","v":{"v":47903.50254,"d":"47903.50"}},{"$f":"(Tabla1[[#This Row],[Factor de tracción ]]*Tabla1[[#This Row],[Carga total]])/1000","v":{"v":23.95175127,"d":"23.95"}},2.38,{"v":1.3,"d":"1.30"},{"$f":"Tabla1[[#This Row],[dmin]]/(Tabla1[[#This Row],[Velod. Avance]]*1000/60)","v":{"v":0.5042016806722689,"d":"0.50"}},{"$f":"Tabla1[[#This Row],[dmin]]/(Tabla1[[#This Row],[Velod. Retroceso]]*1000/60)","v":{"v":0.923076923076923,"d":"0.92"}},{"$f":"Tabla1[[#This Row],[Power shift]]+Tabla1[[#This Row],[T. Avance]]+Tabla1[[#This Row],[T. Retroceso]]","v":{"v":1.5272786037491919,"d":"1.53"}},0.69,{"$f":"(Tabla1[[#This Row],[Producción por ciclo ]]*60*Tabla1[[#This Row],[Eficiencia]])/Tabla1[[#This Row],[Cm]]","v":{"v":130.76343236246663,"d":"130.76"}}]
["D8T ",{"v":39751,"d":"39751.00"},"Orientación",{"v":6.57,"d":"6.570"},{"v":5,"d":"5.000"},1.174,0.625,"Grava suelta ",{"v":1930,"d":"1930.00"},"Empuje promedio",{"$f":"IF(Tabla1[[#This Row],[Nivel de empuje]]=\"Empuje facil\",1.1,IF(Tabla1[[#This Row],[Nivel de empuje]]=\"Empuje promedio\",0.9,IF(Tabla1[[#This Row],[Nivel de empuje]]=\"Empuje medio dificultoso\",0.7,IF(Tabla1[[#This Row],[Nivel de empuje]]=\"Empuje dificultoso\",0.6,\" \"))))","v":{"v":0.9,"d":"0.90"}},{"v":0.5,"d":"0.50"},{"$f":"Tabla1[[#This Row],[Ancho ]]*(Tabla1[[#This Row],[Altura ]]^2)*Tabla1[[#This Row],[Factor Hoja]]","v":{"v":6.202241999999999,"d":"6.202"}},{"$f":"Tabla1[[#This Row],[Producción por ciclo ]]/(Tabla1[[#This Row],[Profundidad]]*Tabla1[[#This Row],[Ancho ]])","v":{"v":1.9847174399999998,"d":"1.98"}},{"$f":"MROUND(3*Tabla1[[#This Row],[Longitud ]],10)","v":{"v":20,"d":"20.00"}},{"$f":"Tabla1[[#This Row],[Producción por ciclo ]]/(Tabla1[[#This Row],[dmin]]*Tabla1[[#This Row],[Ancho ]])","v":{"v":0.062022419999999995,"d":"0.0620"}},{"$f":"IF(Tabla1[[#This Row],[Profundidad]]>Tabla1[[#This Row],[Profundidad de trabajo ]],\"Conforme\",\"No conforme\")","v":"Conforme"},{"$f":"Tabla1[[#This Row],[Densidad ]]*Tabla1[[#This Row],[Producción por ciclo ]]","v":{"v":11970.327059999998,"d":"11970.33"}},{"v":0.1,"d":"0.10"},{"$f":"Tabla1[[#This Row],[Peso ]]+Tabla1[[#This Row],[Peso de material]]","v":{"v":51721.327059999996,"d":"51721.33"}},{"$f":"(Tabla1[[#This Row],[Factor de tracción ]]*Tabla1[[#This Row],[Carga total]])/1000","v":{"v":25.860663529999997,"d":"25.86"}},2.24,{"v":1.3,"d":"1.30"},{"$f":"Tabla1[[#This Row],[dmin]]/(Tabla1[[#This Row],[Velod. Avance]]*1000/60)","v":{"v":0.5357142857142857,"d":"0.54"}},{"$f":"Tabla1[[#This Row],[dmin]]/(Tabla1[[#This Row],[Velod. Retroceso]]*1000/60)","v":{"v":0.923076923076923,"d":"0.92"}},{"$f":"Tabla1[[#This Row],[Power shift]]+Tabla1[[#This Row],[T. Avance]]+Tabla1[[#This Row],[T. Retroceso]]","v":{"v":1.5587912087912086,"d":"1.56"}},0.69,{"$f":"(Tabla1[[#This Row],[Producción por ciclo ]]*60*Tabla1[[#This Row],[Eficiencia]])/Tabla1[[#This Row],[Cm]]","v":{"v":164.72560106309479,"d":"164.73"}}]
["D8T ",{"v":39751,"d":"39751.00"},"Orientación",{"v":6.57,"d":"6.570"},{"v":5,"d":"5.000"},1.174,0.625,"Nieve compacta",{"v":130,"d":"130.00"},"Empuje medio dificultoso",{"$f":"IF(Tabla1[[#This Row],[Nivel de empuje]]=\"Empuje facil\",1.1,IF(Tabla1[[#This Row],[Nivel de empuje]]=\"Empuje promedio\",0.9,IF(Tabla1[[#This Row],[Nivel de empuje]]=\"Empuje medio dificultoso\",0.7,IF(Tabla1[[#This Row],[Nivel de empuje]]=\"Empuje dificultoso\",0.6,\" \"))))","v":{"v":0.7,"d":"0.70"}},0.27,{"$f":"Tabla1[[#This Row],[Ancho ]]*(Tabla1[[#This Row],[Altura ]]^2)*Tabla1[[#This Row],[Factor Hoja]]","v":{"v":4.823965999999999,"d":"4.824"}},{"$f":"Tabla1[[#This Row],[Producción por ciclo ]]/(Tabla1[[#This Row],[Profundidad]]*Tabla1[[#This Row],[Ancho ]])","v":{"v":1.5436691199999997,"d":"1.54"}},{"$f":"MROUND(3*Tabla1[[#This Row],[Longitud ]],10)","v":{"v":20,"d":"20.00"}},{"$f":"Tabla1[[#This Row],[Producción por ciclo ]]/(Tabla1[[#This Row],[dmin]]*Tabla1[[#This Row],[Ancho ]])","v":{"v":0.04823965999999999,"d":"0.0482"}},{"$f":"IF(Tabla1[[#This Row],[Profundidad]]>Tabla1[[#This Row],[Profundidad de trabajo ]],\"Conforme\",\"No conforme\")","v":"Conforme"},{"$f":"Tabla1[[#This Row],[Densidad ]]*Tabla1[[#This Row],[Producción por ciclo ]]","v":{"v":627.1155799999998,"d":"627.12"}},{"v":0.1,"d":"0.10"},{"$f":"Tabla1[[#This Row],[Peso ]]+Tabla1[[#This Row],[Peso de material]]","v":{"v":40378.11558,"d":"40378.12"}},{"$f":"(Tabla1[[#This Row],[Factor de tracción ]]*Tabla1[[#This Row],[Carga total]])/1000","v":{"v":10.9020912066,"d":"10.90"}},6.32,{"v":1.3,"d":"1.30"},{"$f":"Tabla1[[#This Row],[dmin]]/(Tabla1[[#This Row],[Velod. Avance]]*1000/60)","v":{"v":0.189873417721519,"d":"0.19"}},{"$f":"Tabla1[[#This Row],[dmin]]/(Tabla1[[#This Row],[Velod. Retroceso]]*1000/60)","v":{"v":0.923076923076923,"d":"0.92"}},{"$f":"Tabla1[[#This Row],[Power shift]]+Tabla1[[#This Row],[T. Avance]]+Tabla1[[#This Row],[T. Retroceso]]","v":{"v":1.212950340798442,"d":"1.21"}},0.69,{"$f":"(Tabla1[[#This Row],[Producción por ciclo ]]*60*Tabla1[[#This Row],[Eficiencia]])/Tabla1[[#This Row],[Cm]]","v":{"v":164.64993304551652,"d":"164.65"}}]
["D8T ",{"v":39751,"d":"39751.00"},"Orientación",{"v":6.57,"d":"6.570"},{"v":5,"d":"5.000"},1.174,0.625,"Hielo ",{"v":520,"d":"520.00"},"Empuje dificultoso",{"$f":"IF(Tabla1[[#This Row],[Nivel de empuje]]=\"Empuje facil\",1.1,IF(Tabla1[[#This Row],[Nivel de empuje]]=\"Empuje promedio\",0.9,IF(Tabla1[[#This Row],[Nivel de empuje]]=\"Empuje medio dificultoso\",0.7,IF(Tabla1[[#This Row],[Nivel de empuje]]=\"Empuje dificultoso\",0.6,\" \"))))","v":{"v":0.6,"d":"0.60"}},0.12,{"$f":"Tabla1[[#This Row],[Ancho ]]*(Tabla1[[#This Row],[Altura ]]^2)*Tabla1[[#This Row],[Factor Hoja]]","v":{"v":4.134827999999999,"d":"4.135"}},{"$f":"Tabla1[[#This Row],[Producción por ciclo ]]/(Tabla1[[#This Row],[Profundidad]]*Tabla1[[#This Row],[Ancho ]])","v":{"v":1.3231449599999996,"d":"1.32"}},{"$f":"MROUND(3*Tabla1[[#This Row],[Longitud ]],10)","v":{"v":20,"d":"20.00"}},{"$f":"Tabla1[[#This Row],[Producción por ciclo ]]/(Tabla1[[#This Row],[dmin]]*Tabla1[[#This Row],[Ancho ]])","v":{"v":0.04134827999999999,"d":"0.0413"}},{"$f":"IF(Tabla1[[#This Row],[Profundidad]]>Tabla1[[#This Row],[Profundidad de trabajo ]],\"Conforme\",\"No conforme\")","v":"Conforme"},{"$f":"Tabla1[[#This Row],[Densidad ]]*Tabla1[[#This Row],[Producción por ciclo ]]","v":{"v":2150.110559999999,"d":"2150.11"}},{"v":0.1,"d":"0.10"},{"$f":"Tabla1[[#This Row],[Peso ]]+Tabla1[[#This Row],[Peso de material]]","v":{"v":41901.11056,"d":"41901.11"}},{"$f":"(Tabla1[[#This Row],[Factor de tracción ]]*Tabla1[[#This Row],[Carga total]])/1000","v":{"v":5.028133267199999,"d":"5.03"}},9.29,{"v":1.3,"d":"1.30"},{"$f":"Tabla1[[#This Row],[dmin]]/(Tabla1[[#This Row],[Velod. Avance]]*1000/60)","v":{"v":0.12917115177610333,"d":"0.13"}},{"$f":"Tabla1[[#This Row],[dmin]]/(Tabla1[[#This Row],[Velod. Retroceso]]*1000/60)","v":{"v":0.923076923076923,"d":"0.92"}},{"$f":"Tabla1[[#This Row],[Power shift]]+Tabla1[[#This Row],[T. Avance]]+Tabla1[[#This Row],[T. Retroceso]]","v":{"v":1.1522480748530264,"d":"1.15"}},0.69,{"$f":"(Tabla1[[#This Row],[Producción por ciclo ]]*60*Tabla1[[#This Row],[Eficiencia]])/Tabla1[[#This Row],[Cm]]","v":{"v":148.56338920057198,"d":"148.56"}}]
["D8T ",{"v":39751,"d":"39751.00"},"Orientación",{"v":6.57,"d":"6.570"},{"v":5,"d":"5.000"},1.174,0.625,"Tierra firme ",{"v":1510,"d":"1510.00"},"Empuje facil",{"$f":"IF(Tabla1[[#This Row],[Nivel de empuje]]=\"Empuje facil\",1.1,IF(Tabla1[[#This Row],[Nivel de empuje]]=\"Empuje promedio\",0.9,IF(Tabla1[[#This Row],[Nivel de empuje]]=\"Empuje medio dificultoso\",0.7,IF(Tabla1[[#This Row],[Nivel de empuje]]=\"Empuje dificultoso\",0.6,\" \"))))","v":{"v":1.1,"d":"1.10"}},{"v":0.9,"d":"0.90"},{"$f":"Tabla1[[#This Row],[Ancho ]]*(Tabla1[[#This Row],[Altura ]]^2)*Tabla1[[#This Row],[Factor Hoja]]","v":{"v":7.580518,"d":"7.581"}},{"$f":"Tabla1[[#This Row],[Producción por ciclo ]]/(Tabla1[[#This Row],[Profundidad]]*Tabla1[[#This Row],[Ancho ]])","v":{"v":2.42576576,"d":"2.43"}},{"$f":"MROUND(3*Tabla1[[#This Row],[Longitud ]],10)","v":{"v":20,"d":"20.00"}},{"$f":"Tabla1[[#This Row],[Producción por ciclo ]]/(Tabla1[[#This Row],[dmin]]*Tabla1[[#This Row],[Ancho ]])","v":{"v":0.07580518,"d":"0.0758"}},{"$f":"IF(Tabla1[[#This Row],[Profundidad]]>Tabla1[[#This Row],[Profundidad de trabajo ]],\"Conforme\",\"No conforme\")","v":"Conforme"},{"$f":"Tabla1[[#This Row],[Densidad ]]*Tabla1[[#This Row],[Producción por ciclo ]]","v":{"v":11446.58218,"d":"11446.58"}},{"$f":"2*0.05","v":{"v":0.1,"d":"0.10"}},{"$f":"Tabla1[[#This Row],[Peso ]]+Tabla1[[#This Row],[Peso de material]]","v":{"v":51197.58218,"d":"51197.58"}},{"$f":"(Tabla1[[#This Row],[Factor de tracción ]]*Tabla1[[#This Row],[Carga total]])/1000","v":{"v":46.077823962000004,"d":"46.08"}},{"v":0.9,"d":"0.90"},{"v":1.3,"d":"1.30"},{"$f":"Tabla1[[#This Row],[dmin]]/(Tabla1[[#This Row],[Velod. Avance]]*1000/60)","v":{"v":1.3333333333333333,"d":"1.33"}},{"$f":"Tabla1[[#This Row],[dmin]]/(Tabla1[[#This Row],[Velod. Retroceso]]*1000/60)","v":{"v":0.923076923076923,"d":"0.92"}},{"$f":"Tabla1[[#This Row],[Power shift]]+Tabla1[[#This Row],[T. Avance]]+Tabla1[[#This Row],[T. Retroceso]]","v":{"v":2.3564102564102565,"d":"2.36"}},0.69,{"$f":"(Tabla1[[#This Row],[Producción por ciclo ]]*60*Tabla1[[#This Row],[Eficiencia]])/Tabla1[[#This Row],[Cm]]","v":{"v":133.1828548726877,"d":"133.18"}}]
["D8T ",{"v":39751,"d":"39751.00"},"Orientación",{"v":6.57,"d":"6.570"},{"v":5,"d":"5.000"},1.174,0.625,"Tierra suelta ",{"v":1250,"d":"1250.00"},"Empuje facil",{"$f":"IF(Tabla1[[#This Row],[Nivel de empuje]]=\"Empuje facil\",1.1,IF(Tabla1[[#This Row],[Nivel de empuje]]=\"Empuje promedio\",0.9,IF(Tabla1[[#This Row],[Nivel de empuje]]=\"Empuje medio dificultoso\",0.7,IF(Tabla1[[#This Row],[Nivel de empuje]]=\"Empuje dificultoso\",0.6,\" \"))))","v":{"v":1.1,"d":"1.10"}},{"v":0.6,"d":"0.60"},{"$f":"Tabla1[[#This Row],[Ancho ]]*(Tabla1[[#This Row],[Altura ]]^2)*Tabla1[[#This Row],[Factor Hoja]]","v":{"v":7.580518,"d":"7.581"}},{"$f":"Tabla1[[#This Row],[Producción por ciclo ]]/(Tabla1[[#This Row],[Profundidad]]*Tabla1[[#This Row],[Ancho ]])","v":{"v":2.42576576,"d":"2.43"}},{"$f":"MROUND(3*Tabla1[[#This Row],[Longitud ]],10)","v":{"v":20,"d":"20.00"}},{"$f":"Tabla1[[#This Row],[Producción por ciclo ]]/(Tabla1[[#This Row],[dmin]]*Tabla1[[#This Row],[Ancho ]])","v":{"v":0.07580518,"d":"0.0758"}},{"$f":"IF(Tabla1[[#This Row],[Profundidad]]>Tabla1[[#This Row],[Profundidad de trabajo ]],\"Conforme\",\"No conforme\")","v":"Conforme"},{"$f":"Tabla1[[#This Row],[Densidad ]]*Tabla1[[#This Row],[Producción por ciclo ]]","v":{"v":9475.6475,"d":"9475.65"}},{"v":0.1,"d":"0.10"},{"$f":"Tabla1[[#This Row],[Peso ]]+Tabla1[[#This Row],[Peso de material]]","v":{"v":49226.6475,"d":"49226.65"}},{"$f":"(Tabla1[[#This Row],[Factor de tracción ]]*Tabla1[[#This Row],[Carga total]])/1000","v":{"v":29.5359885,"d":"29.54"}},1.92,{"v":1.3,"d":"1.30"},{"$f":"Tabla1[[#This Row],[dmin]]/(Tabla1[[#This Row],[Velod. Avance]]*1000/60)","v":{"v":0.625,"d":"0.63"}},{"$f":"Tabla1[[#This Row],[dmin]]/(Tabla1[[#This Row],[Velod. Retroceso]]*1000/60)","v":{"v":0.923076923076923,"d":"0.92"}},{"$f":"Tabla1[[#This Row],[Power shift]]+Tabla1[[#This Row],[T. Avance]]+Tabla1[[#This Row],[T. Retroceso]]","v":{"v":1.648076923076923,"d":"1.65"}},0.69,{"$f":"(Tabla1[[#This Row],[Producción por ciclo ]]*60*Tabla1[[#This Row],[Eficiencia]])/Tabla1[[#This Row],[Cm]]","v":{"v":190.4240274259043,"d":"190.42"}}]
["D8T ",{"v":39751,"d":"39751.00"},"Orientación",{"v":6.57,"d":"6.570"},{"v":5,"d":"5.000"},1.174,0.625,"Carbón ",{"v":1190,"d":"1190.00"},"Empuje promedio",{"$f":"IF(Tabla1[[#This Row],[Nivel de empuje]]=\"Empuje facil\",1.1,IF(Tabla1[[#This Row],[Nivel de empuje]]=\"Empuje promedio\",0.9,IF(Tabla1[[#This Row],[Nivel de empuje]]=\"Empuje medio dificultoso\",0.7,IF(Tabla1[[#This Row],[Nivel de empuje]]=\"Empuje dificultoso\",0.6,\" \"))))","v":{"v":0.9,"d":"0.90"}},{"v":0.6,"d":"0.60"},{"$f":"Tabla1[[#This Row],[Ancho ]]*(Tabla1[[#This Row],[Altura ]]^2)*Tabla1[[#This Row],[Factor Hoja]]","v":{"v":6.202241999999999,"d":"6.202"}},{"$f":"Tabla1[[#This Row],[Producción por ciclo ]]/(Tabla1[[#This Row],[Profundidad]]*Tabla1[[#This Row],[Ancho ]])","v":{"v":1.9847174399999998,"d":"1.98"}},{"$f":"MROUND(3*Tabla1[[#This Row],[Longitud ]],10)","v":{"v":20,"d":"20.00"}},{"$f":"Tabla1[[#This Row],[Producción por ciclo ]]/(Tabla1[[#This Row],[dmin]]*Tabla1[[#This Row],[Ancho ]])","v":{"v":0.062022419999999995,"d":"0.0620"}},{"$f":"IF(Tabla1[[#This Row],[Profundidad]]>Tabla1[[#This Row],[Profundidad de trabajo ]],\"Conforme\",\"No conforme\")","v":"Conforme"},{"$f":"Tabla1[[#This Row],[Densidad ]]*Tabla1[[#This Row],[Producción por ciclo ]]","v":{"v":7380.667979999999,"d":"7380.67"}},{"v":0.1,"d":"0.10"},{"$f":"Tabla1[[#This Row],[Peso ]]+Tabla1[[#This Row],[Peso de material]]","v":{"v":47131.66798,"d":"47131.67"}},{"$f":"(Tabla1[[#This Row],[Factor de tracción ]]*Tabla1[[#This Row],[Carga total]])/1000","v":{"v":28.279000787999998,"d":"28.28"}},2.01,{"v":1.3,"d":"1.30"},{"$f":"Tabla1[[#This Row],[dmin]]/(Tabla1[[#This Row],[Velod. Avance]]*1000/60)","v":{"v":0.5970149253731345,"d":"0.60"}},{"$f":"Tabla1[[#This Row],[dmin]]/(Tabla1[[#This Row],[Velod. Retroceso]]*1000/60)","v":{"v":0.923076923076923,"d":"0.92"}},{"$f":"Tabla1[[#This Row],[Power shift]]+Tabla1[[#This Row],[T. Avance]]+Tabla1[[#This Row],[T. Retroceso]]","v":{"v":1.6200918484500575,"d":"1.62"}},0.69,{"$f":"(Tabla1[[#This Row],[Producción por ciclo ]]*60*Tabla1[[#This Row],[Eficiencia]])/Tabla1[[#This Row],[Cm]]","v":{"v":158.49275400382675,"d":"158.49"}}]
["D8T ",{"v":39751,"d":"39751.00"},"Semi universal",{"v":6.39,"d":"6.390"},{"v":3.93,"d":"3.930"},{"v":1.69,"d":"1.690"},0.511,"Concreto ",{"v":2400,"d":"2400.00"},"Empuje dificultoso",{"$f":"IF(Tabla1[[#This Row],[Nivel de empuje]]=\"Empuje facil\",1.1,IF(Tabla1[[#This Row],[Nivel de empuje]]=\"Empuje promedio\",0.9,IF(Tabla1[[#This Row],[Nivel de empuje]]=\"Empuje medio dificultoso\",0.7,IF(Tabla1[[#This Row],[Nivel de empuje]]=\"Empuje dificultoso\",0.6,\" \"))))","v":{"v":0.6,"d":"0.60"}},0.45,{"$f":"Tabla1[[#This Row],[Ancho ]]*(Tabla1[[#This Row],[Altura ]]^2)*Tabla1[[#This Row],[Factor Hoja]]","v":{"v":6.7346838,"d":"6.735"}},{"$f":"Tabla1[[#This Row],[Producción por ciclo ]]/(Tabla1[[#This Row],[Profundidad]]*Tabla1[[#This Row],[Ancho ]])","v":{"v":3.353542074363992,"d":"3.35"}},{"$f":"MROUND(3*Tabla1[[#This Row],[Longitud ]],10)","v":{"v":20,"d":"20.00"}},{"$f":"Tabla1[[#This Row],[Producción por ciclo ]]/(Tabla1[[#This Row],[dmin]]*Tabla1[[#This Row],[Ancho ]])","v":{"v":0.085683,"d":"0.0857"}},{"$f":"IF(Tabla1[[#This Row],[Profundidad]]>Tabla1[[#This Row],[Profundidad de trabajo ]],\"Conforme\",\"No conforme\")","v":"Conforme"},{"$f":"Tabla1[[#This Row],[Densidad ]]*Tabla1[[#This Row],[Producción por ciclo ]]","v":{"v":16163.24112,"d":"16163.24"}},{"v":0.1,"d":"0.10"},{"$f":"Tabla1[[#This Row],[Peso ]]+Tabla1[[#This Row],[Peso de material]]","v":{"v":55914.24112,"d":"55914.24"}},{"$f":"(Tabla1[[#This Row],[Factor de tracción ]]*Tabla1[[#This Row],[Carga total]])/1000","v":{"v":25.161408504,"d":"25.16"}},2.31,{"v":1.3,"d":"1.30"},{"$f":"Tabla1[[#This Row],[dmin]]/(Tabla1[[#This Row],[Velod. Avance]]*1000/60)","v":{"v":0.5194805194805194,"d":"0.52"}},{"$f":"Tabla1[[#This Row],[dmin]]/(Tabla1[[#This Row],[Velod. Retroceso]]*1000/60)","v":{"v":0.923076923076923,"d":"0.92"}},{"$f":"Tabla1[[#This Row],[Power shift]]+Tabla1[[#This Row],[T. Avance]]+Tabla1[[#This Row],[T. Retroceso]]","v":{"v":1.5425574425574424,"d":"1.54"}},0.69,{"$f":"(Tabla1[[#This Row],[Producción por ciclo ]]*60*Tabla1[[#This Row],[Eficiencia]])/Tabla1[[#This Row],[Cm]]","v":{"v":180.74912585280748,"d":"180.75"}}]
["D8T ",{"v":39751,"d":"39751.00"},"Semi universal",{"v":6.39,"d":"6.390"},{"v":3.93,"d":"3.930"},{"v":1.69,"d":"1.690"},0.511,"Arcilla seca ",{"v":1480,"d":"1480.00"},"Empuje medio dificultoso",{"$f":"IF(Tabla1[[#This Row],[Nivel de empuje]]=\"Empuje facil\",1.1,IF(Tabla1[[#This Row],[Nivel de empuje]]=\"Empuje promedio\",0.9,IF(Tabla1[[#This Row],[Nivel de empuje]]=\"Empuje medio dificultoso\",0.7,IF(Tabla1[[#This Row],[Nivel de empuje]]=\"Empuje dificultoso\",0.6,\" \"))))","v":{"v":0.7,"d":"0.70"}},{"v":0.9,"d":"0.90"},{"$f":"Tabla1[[#This Row],[Ancho ]]*(Tabla1[[#This Row],[Altura ]]^2)*Tabla1[[#This Row],[Factor Hoja]]","v":{"v":7.857131099999999,"d":"7.857"}},{"$f":"Tabla1[[#This Row],[Producción por ciclo ]]/(Tabla1[[#This Row],[Profundidad]]*Tabla1[[#This Row],[Ancho ]])","v":{"v":3.912465753424657,"d":"3.91"}},{"$f":"MROUND(3*Tabla1[[#This Row],[Longitud ]],10)","v":{"v":20,"d":"20.00"}},{"$f":"Tabla1[[#This Row],[Producción por ciclo ]]/(Tabla1[[#This Row],[dmin]]*Tabla1[[#This Row],[Ancho ]])","v":{"v":0.09996349999999998,"d":"0.1000"}},{"$f":"IF(Tabla1[[#This Row],[Profundidad]]>Tabla1[[#This Row],[Profundidad de trabajo ]],\"Conforme\",\"No conforme\")","v":"Conforme"},{"$f":"Tabla1[[#This Row],[Densidad ]]*Tabla1[[#This Row],[Producción por ciclo ]]","v":{"v":11628.554027999999,"d":"11628.55"}},{"v":0.1,"d":"0.10"},{"$f":"Tabla1[[#This Row],[Peso ]]+Tabla1[[#This Row],[Peso de material]]","v":{"v":51379.554028,"d":"51379.55"}},{"$f":"(Tabla1[[#This Row],[Factor de tracción ]]*Tabla1[[#This Row],[Carga total]])/1000","v":{"v":46.2415986252,"d":"46.24"}},{"v":0.8,"d":"0.80"},{"v":1.3,"d":"1.30"},{"$f":"Tabla1[[#This Row],[dmin]]/(Tabla1[[#This Row],[Velod. Avance]]*1000/60)","v":{"v":1.5,"d":"1.50"}},{"$f":"Tabla1[[#This Row],[dmin]]/(Tabla1[[#This Row],[Velod. Retroceso]]*1000/60)","v":{"v":0.923076923076923,"d":"0.92"}},{"$f":"Tabla1[[#This Row],[Power shift]]+Tabla1[[#This Row],[T. Avance]]+Tabla1[[#This Row],[T. Retroceso]]","v":{"v":2.523076923076923,"d":"2.52"}},0.69,{"$f":"(Tabla1[[#This Row],[Producción por ciclo ]]*60*Tabla1[[#This Row],[Eficiencia]])/Tabla1[[#This Row],[Cm]]","v":{"v":128.92402311036582,"d":"128.92"}}]
["D8T ",{"v":39751,"d":"39751.00"},"Semi universal",{"v":6.39,"d":"6.390"},{"v":3.93,"d":"3.930"},{"v":1.69,"d":"1.690"},0.511,"Arcilla húmeda",{"v":1660,"d":"1660.00"},"Empuje facil",{"$f":"IF(Tabla1[[#This Row],[Nivel de empuje]]=\"Empuje facil\",1.1,IF(Tabla1[[#This Row],[Nivel de empuje]]=\"Empuje promedio\",0.9,IF(Tabla1[[#This Row],[Nivel de empuje]]=\"Empuje medio dificultoso\",0.7,IF(Tabla1[[#This Row],[Nivel de empuje]]=\"Empuje dificultoso\",0.6,\" \"))))","v":{"v":1.1,"d":"1.10"}},{"v":0.7,"d":"0.70"},{"$f":"Tabla1[[#This Row],[Ancho ]]*(Tabla1[[#This Row],[Altura ]]^2)*Tabla1[[#This Row],[Factor Hoja]]","v":{"v":12.3469203,"d":"12.347"}},{"$f":"Tabla1[[#This Row],[Producción por ciclo ]]/(Tabla1[[#This Row],[Profundidad]]*Tabla1[[#This Row],[Ancho ]])","v":{"v":6.148160469667319,"d":"6.15"}},{"$f":"MROUND(3*Tabla1[[#This Row],[Longitud ]],10)","v":{"v":20,"d":"20.00"}},{"$f":"Tabla1[[#This Row],[Producción por ciclo ]]/(Tabla1[[#This Row],[dmin]]*Tabla1[[#This Row],[Ancho ]])","v":{"v":0.1570855,"d":"0.1571"}},{"$f":"IF(Tabla1[[#This Row],[Profundidad]]>Tabla1[[#This Row],[Profundidad de trabajo ]],\"Conforme\",\"No conforme\")","v":"Conforme"},{"$f":"Tabla1[[#This Row],[Densidad ]]*Tabla1[[#This Row],[Producción por ciclo ]]","v":{"v":20495.887698000002,"d":"20495.89"}},{"v":0.1,"d":"0.10"},{"$f":"Tabla1[[#This Row],[Peso ]]+Tabla1[[#This Row],[Peso de material]]","v":{"v":60246.887698000006,"d":"60246.89"}},{"$f":"(Tabla1[[#This Row],[Factor de tracción ]]*Tabla1[[#This Row],[Carga total]])/1000","v":{"v":42.1728213886,"d":"42.17"}},1.18,{"v":1.3,"d":"1.30"},{"$f":"Tabla1[[#This Row],[dmin]]/(Tabla1[[#This Row],[Velod. Avance]]*1000/60)","v":{"v":1.0169491525423728,"d":"1.02"}},{"$f":"Tabla1[[#This Row],[dmin]]/(Tabla1[[#This Row],[Velod. Retroceso]]*1000/60)","v":{"v":0.923076923076923,"d":"0.92"}},{"$f":"Tabla1[[#This Row],[Power shift]]+Tabla1[[#This Row],[T. Avance]]+Tabla1[[#This Row],[T. Retroceso]]","v":{"v":2.040026075619296,"d":"2.04"}},0.69,{"$f":"(Tabla1[[#This Row],[Producción por ciclo ]]*60*Tabla1[[#This Row],[Eficiencia]])/Tabla1[[#This Row],[Cm]]","v":{"v":250.56665036245928,"d":"250.57"}}]
["D8T ",{"v":39751,"d":"39751.00"},"Semi universal",{"v":6.39,"d":"6.390"},{"v":3.93,"d":"3.930"},{"v":1.69,"d":"1.690"},0.511,"Arena seca ",{"v":1420,"d":"1420.00"},"Empuje facil",{"$f":"IF(Tabla1[[#This Row],[Nivel de empuje]]=\"Empuje facil\",1.1,IF(Tabla1[[#This Row],[Nivel de empuje]]=\"Empuje promedio\",0.9,IF(Tabla1[[#This Row],[Nivel de empuje]]=\"Empuje medio dificultoso\",0.7,IF(Tabla1[[#This Row],[Nivel de empuje]]=\"Empuje dificultoso\",0.6,\" \"))))","v":{"v":1.1,"d":"1.10"}},0.39,{"$f":"Tabla1[[#This Row],[Ancho ]]*(Tabla1[[#This Row],[Altura ]]^2)*Tabla1[[#This Row],[Factor Hoja]]","v":{"v":12.3469203,"d":"12.347"}},{"$f":"Tabla1[[#This Row],[Producción por ciclo ]]/(Tabla1[[#This Row],[Profundidad]]*Tabla1[[#This Row],[Ancho ]])","v":{"v":6.148160469667319,"d":"6.15"}},{"$f":"MROUND(3*Tabla1[[#This Row],[Longitud ]],10)","v":{"v":20,"d":"20.00"}},{"$f":"Tabla1[[#This Row],[Producción por ciclo ]]/(Tabla1[[#This Row],[dmin]]*Tabla1[[#This Row],[Ancho ]])","v":{"v":0.1570855,"d":"0.1571"}},{"$f":"IF(Tabla1[[#This Row],[Profundidad]]>Tabla1[[#This Row],[Profundidad de trabajo ]],\"Conforme\",\"No conforme\")","v":"Conforme"},{"$f":"Tabla1[[#This Row],[Densidad ]]*Tabla1[[#This Row],[Producción por ciclo ]]","v":{"v":17532.626826,"d":"17532.63"}},{"v":0.1,"d":"0.10"},{"$f":"Tabla1[[#This Row],[Peso ]]+Tabla1[[#This Row],[Peso de material]]","v":{"v":57283.626826,"d":"57283.63"}},{"$f":"(Tabla1[[#This Row],[Factor de tracción ]]*Tabla1[[#This Row],[Carga total]])/1000","v":{"v":22.340614462140003,"d":"22.34"}},{"v":2.5,"d":"2.50"},{"v":1.3,"d":"1.30"},{"$f":"Tabla1[[#This Row],[dmin]]/(Tabla1[[#This Row],[Velod. Avance]]*1000/60)","v":{"v":0.48000000000000004,"d":"0.48"}},{"$f":"Tabla1[[#This Row],[dmin]]/(Tabla1[[#This Row],[Velod. Retroceso]]*1000/60)","v":{"v":0.923076923076923,"d":"0.92"}},{"$f":"Tabla1[[#This Row],[Power shift]]+Tabla1[[#This Row],[T. Avance]]+Tabla1[[#This Row],[T. Retroceso]]","v":{"v":1.503076923076923,"d":"1.50"}},0.69,{"$f":"(Tabla1[[#This Row],[Producción por ciclo ]]*60*Tabla1[[#This Row],[Eficiencia]])/Tabla1[[#This Row],[Cm]]","v":{"v":340.07740560184243,"d":"340.08"}}]
["D8T ",{"v":39751,"d":"39751.00"},"Semi universal",{"v":6.39,"d":"6.390"},{"v":3.93,"d":"3.930"},{"v":1.69,"d":"1.690"},0.511,"Arena húmeda ",{"v":1690,"d":"1690.00"},"Empuje medio dificultoso",{"$f":"IF(Tabla1[[#This Row],[Nivel de empuje]]=\"Empuje facil\",1.1,IF(Tabla1[[#This Row],[Nivel de empuje]]=\"Empuje promedio\",0.9,IF(Tabla1[[#This Row],[Nivel de empuje]]=\"Empuje medio dificultoso\",0.7,IF(Tabla1[[#This Row],[Nivel de empuje]]=\"Empuje dificultoso\",0.6,\" \"))))","v":{"v":0.7,"d":"0.70"}},{"v":0.5,"d":"0.50"},{"$f":"Tabla1[[#This Row],[Ancho ]]*(Tabla1[[#This Row],[Altura ]]^2)*Tabla1[[#This Row],[Factor Hoja]]","v":{"v":7.857131099999999,"d":"7.857"}},{"$f":"Tabla1[[#This Row],[Producción por ciclo ]]/(Tabla1[[#This Row],[Profundidad]]*Tabla1[[#This Row],[Ancho ]])","v":{"v":3.912465753424657,"d":"3.91"}},{"$f":"MROUND(3*Tabla1[[#This Row],[Longitud ]],10)","v":{"v":20,"d":"20.00"}},{"$f":"Tabla1[[#This Row],[Producción por ciclo ]]/(Tabla1[[#This Row],[dmin]]*Tabla1[[#This Row],[Ancho ]])","v":{"v":0.09996349999999998,"d":"0.1000"}},{"$f":"IF(Tabla1[[#This Row],[Profundidad]]>Tabla1[[#This Row],[Profundidad de trabajo ]],\"Conforme\",\"No conforme\")","v":"Conforme"},{"$f":"Tabla1[[#This Row],[Densidad ]]*Tabla1[[#This Row],[Producción por ciclo ]]","v":{"v":13278.551559,"d":"13278.55"}},{"v":0.1,"d":"0.10"},{"$f":"Tabla1[[#This Row],[Peso ]]+Tabla1[[#This Row],[Peso de material]]","v":{"v":53029.551559,"d":"53029.55"}},{"$f":"(Tabla1[[#This Row],[Factor de tracción ]]*Tabla1[[#This Row],[Carga total]])/1000","v":{"v":26.5147757795,"d":"26.51"}},2.15,{"v":1.3,"d":"1.30"},{"$f":"Tabla1[[#This Row],[dmin]]/(Tabla1[[#This Row],[Velod. Avance]]*1000/60)","v":{"v":0.5581395348837209,"d":"0.56"}},{"$f":"Tabla1[[#This Row],[dmin]]/(Tabla1[[#This Row],[Velod. Retroceso]]*1000/60)","v":{"v":0.923076923076923,"d":"0.92"}},{"$f":"Tabla1[[#This Row],[Power shift]]+Tabla1[[#This Row],[T. Avance]]+Tabla1[[#This Row],[T. Retroceso]]","v":{"v":1.581216457960644,"d":"1.58"}},0.69,{"$f":"(Tabla1[[#This Row],[Producción por ciclo ]]*60*Tabla1[[#This Row],[Eficiencia]])/Tabla1[[#This Row],[Cm]]","v":{"v":205.71834166179428,"d":"205.72"}}]
["D8T ",{"v":39751,"d":"39751.00"},"Semi universal",{"v":6.39,"d":"6.390"},{"v":3.93,"d":"3.930"},{"v":1.69,"d":"1.690"},0.511,"Grava suelta ",{"v":1930,"d":"1930.00"},"Empuje promedio",{"$f":"IF(Tabla1[[#This Row],[Nivel de empuje]]=\"Empuje facil\",1.1,IF(Tabla1[[#This Row],[Nivel de empuje]]=\"Empuje promedio\",0.9,IF(Tabla1[[#This Row],[Nivel de empuje]]=\"Empuje medio dificultoso\",0.7,IF(Tabla1[[#This Row],[Nivel de empuje]]=\"Empuje dificultoso\",0.6,\" \"))))","v":{"v":0.9,"d":"0.90"}},{"v":0.5,"d":"0.50"},{"$f":"Tabla1[[#This Row],[Ancho ]]*(Tabla1[[#This Row],[Altura ]]^2)*Tabla1[[#This Row],[Factor Hoja]]","v":{"v":10.1020257,"d":"10.102"}},{"$f":"Tabla1[[#This Row],[Producción por ciclo ]]/(Tabla1[[#This Row],[Profundidad]]*Tabla1[[#This Row],[Ancho ]])","v":{"v":5.030313111545988,"d":"5.03"}},{"$f":"MROUND(3*Tabla1[[#This Row],[Longitud ]],10)","v":{"v":20,"d":"20.00"}},{"$f":"Tabla1[[#This Row],[Producción por ciclo ]]/(Tabla1[[#This Row],[dmin]]*Tabla1[[#This Row],[Ancho ]])","v":{"v":0.12852449999999999,"d":"0.1285"}},{"$f":"IF(Tabla1[[#This Row],[Profundidad]]>Tabla1[[#This Row],[Profundidad de trabajo ]],\"Conforme\",\"No conforme\")","v":"Conforme"},{"$f":"Tabla1[[#This Row],[Densidad ]]*Tabla1[[#This Row],[Producción por ciclo ]]","v":{"v":19496.909601,"d":"19496.91"}},{"v":0.1,"d":"0.10"},{"$f":"Tabla1[[#This Row],[Peso ]]+Tabla1[[#This Row],[Peso de material]]","v":{"v":59247.909601,"d":"59247.91"}},{"$f":"(Tabla1[[#This Row],[Factor de tracción ]]*Tabla1[[#This Row],[Carga total]])/1000","v":{"v":29.623954800499998,"d":"29.62"}},1.92,{"v":1.3,"d":"1.30"},{"$f":"Tabla1[[#This Row],[dmin]]/(Tabla1[[#This Row],[Velod. Avance]]*1000/60)","v":{"v":0.625,"d":"0.63"}},{"$f":"Tabla1[[#This Row],[dmin]]/(Tabla1[[#This Row],[Velod. Retroceso]]*1000/60)","v":{"v":0.923076923076923,"d":"0.92"}},{"$f":"Tabla1[[#This Row],[Power shift]]+Tabla1[[#This Row],[T. Avance]]+Tabla1[[#This Row],[T. Retroceso]]","v":{"v":1.648076923076923,"d":"1.65"}},0.69,{"$f":"(Tabla1[[#This Row],[Producción por ciclo ]]*60*Tabla1[[#This Row],[Eficiencia]])/Tabla1[[#This Row],[Cm]]","v":{"v":253.76477160980164,"d":"253.76"}}]
["D8T ",{"v":39751,"d":"39751.00"},"Semi universal",{"v":6.39,"d":"6.390"},{"v":3.93,"d":"3.930"},{"v":1.69,"d":"1.690"},0.511,"Nieve compacta",{"v":130,"d":"130.00"},"Empuje medio dificultoso",{"$f":"IF(Tabla1[[#This Row],[Nivel de empuje]]=\"Empuje facil\",1.1,IF(Tabla1[[#This Row],[Nivel de empuje]]=\"Empuje promedio\",0.9,IF(Tabla1[[#This Row],[Nivel de empuje]]=\"Empuje medio dificultoso\",0.7,IF(Tabla1[[#This Row],[Nivel de empuje]]=\"Empuje dificultoso\",0.6,\" \"))))","v":{"v":0.7,"d":"0.70"}},0.27,{"$f":"Tabla1[[#This Row],[Ancho ]]*(Tabla1[[#This Row],[Altura ]]^2)*Tabla1[[#This Row],[Factor Hoja]]","v":{"v":7.857131099999999,"d":"7.857"}},{"$f":"Tabla1[[#This Row],[Producción por ciclo ]]/(Tabla1[[#This Row],[Profundidad]]*Tabla1[[#This Row],[Ancho ]])","v":{"v":3.912465753424657,"d":"3.91"}},{"$f":"MROUND(3*Tabla1[[#This Row],[Longitud ]],10)","v":{"v":20,"d":"20.00"}},{"$f":"Tabla1[[#This Row],[Producción por ciclo ]]/(Tabla1[[#This Row],[dmin]]*Tabla1[[#This Row],[Ancho ]])","v":{"v":0.09996349999999998,"d":"0.1000"}},{"$f":"IF(Tabla1[[#This Row],[Profundidad]]>Tabla1[[#This Row],[Profundidad de trabajo ]],\"Conforme\",\"No conforme\")","v":"Conforme"},{"$f":"Tabla1[[#This Row],[Densidad ]]*Tabla1[[#This Row],[Producción por ciclo ]]","v":{"v":1021.4270429999999,"d":"1021.43"}},{"v":0.1,"d":"0.10"},{"$f":"Tabla1[[#This Row],[Peso ]]+Tabla1[[#This Row],[Peso de material]]","v":{"v":40772.427043,"d":"40772.43"}},{"$f":"(Tabla1[[#This Row],[Factor de tracción ]]*Tabla1[[#This Row],[Carga total]])/1000","v":{"v":11.008555301610002,"d":"11.01"}},4.89,{"v":1.3,"d":"1.30"},{"$f":"Tabla1[[#This Row],[dmin]]/(Tabla1[[#This Row],[Velod. Avance]]*1000/60)","v":{"v":0.24539877300613497,"d":"0.25"}},{"$f":"Tabla1[[#This Row],[dmin]]/(Tabla1[[#This Row],[Velod. Retroceso]]*1000/60)","v":{"v":0.923076923076923,"d":"0.92"}},{"$f":"Tabla1[[#This Row],[Power shift]]+Tabla1[[#This Row],[T. Avance]]+Tabla1[[#This Row],[T. Retroceso]]","v":{"v":1.2684756960830579,"d":"1.27"}},0.69,{"$f":"(Tabla1[[#This Row],[Producción por ciclo ]]*60*Tabla1[[#This Row],[Eficiencia]])/Tabla1[[#This Row],[Cm]]","v":{"v":256.43788725669106,"d":"256.44"}}]
["D8T ",{"v":39751,"d":"39751.00"},"Semi universal",{"v":6.39,"d":"6.390"},{"v":3.93,"d":"3.930"},{"v":1.69,"d":"1.690"},0.511,"Hielo ",{"v":520,"d":"520.00"},"Empuje dificultoso",{"$f":"IF(Tabla1[[#This Row],[Nivel de empuje]]=\"Empuje facil\",1.1,IF(Tabla1[[#This Row],[Nivel de empuje]]=\"Empuje promedio\",0.9,IF(Tabla1[[#This Row],[Nivel de empuje]]=\"Empuje medio dificultoso\",0.7,IF(Tabla1[[#This Row],[Nivel de empuje]]=\"Empuje dificultoso\",0.6,\" \"))))","v":{"v":0.6,"d":"0.60"}},0.12,{"$f":"Tabla1[[#This Row],[Ancho ]]*(Tabla1[[#This Row],[Altura ]]^2)*Tabla1[[#This Row],[Factor Hoja]]","v":{"v":6.7346838,"d":"6.735"}},{"$f":"Tabla1[[#This Row],[Producción por ciclo ]]/(Tabla1[[#This Row],[Profundidad]]*Tabla1[[#This Row],[Ancho ]])","v":{"v":3.353542074363992,"d":"3.35"}},{"$f":"MROUND(3*Tabla1[[#This Row],[Longitud ]],10)","v":{"v":20,"d":"20.00"}},{"$f":"Tabla1[[#This Row],[Producción por ciclo ]]/(Tabla1[[#This Row],[dmin]]*Tabla1[[#This Row],[Ancho ]])","v":{"v":0.085683,"d":"0.0857"}},{"$f":"IF(Tabla1[[#This Row],[Profundidad]]>Tabla1[[#This Row],[Profundidad de trabajo ]],\"Conforme\",\"No conforme\")","v":"Conforme"},{"$f":"Tabla1[[#This Row],[Densidad ]]*Tabla1[[#This Row],[Producción por ciclo ]]","v":{"v":3502.035576,"d":"3502.04"}},{"v":0.1,"d":"0.10"},{"$f":"Tabla1[[#This Row],[Peso ]]+Tabla1[[#This Row],[Peso de material]]","v":{"v":43253.035576,"d":"43253.04"}},{"$f":"(Tabla1[[#This Row],[Factor de tracción ]]*Tabla1[[#This Row],[Carga total]])/1000","v":{"v":5.19036426912,"d":"5.19"}},{"v":9.9,"d":"9.90"},{"v":1.3,"d":"1.30"},{"$f":"Tabla1[[#This Row],[dmin]]/(Tabla1[[#This Row],[Velod. Avance]]*1000/60)","v":{"v":0.12121212121212122,"d":"0.12"}},{"$f":"Tabla1[[#This Row],[dmin]]/(Tabla1[[#This Row],[Velod. Retroceso]]*1000/60)","v":{"v":0.923076923076923,"d":"0.92"}},{"$f":"Tabla1[[#This Row],[Power shift]]+Tabla1[[#This Row],[T. Avance]]+Tabla1[[#This Row],[T. Retroceso]]","v":{"v":1.1442890442890443,"d":"1.14"}},0.69,{"$f":"(Tabla1[[#This Row],[Producción por ciclo ]]*60*Tabla1[[#This Row],[Eficiencia]])/Tabla1[[#This Row],[Cm]]","v":{"v":243.65863739718884,"d":"243.66"}}]
["D8T ",{"v":39751,"d":"39751.00"},"Semi universal",{"v":6.39,"d":"6.390"},{"v":3.93,"d":"3.930"},{"v":1.69,"d":"1.690"},0.511,"Tierra firme ",{"v":1510,"d":"1510.00"},"Empuje facil",{"$f":"IF(Tabla1[[#This Row],[Nivel de empuje]]=\"Empuje facil\",1.1,IF(Tabla1[[#This Row],[Nivel de empuje]]=\"Empuje promedio\",0.9,IF(Tabla1[[#This Row],[Nivel de empuje]]=\"Empuje medio dificultoso\",0.7,IF(Tabla1[[#This Row],[Nivel de empuje]]=\"Empuje dificultoso\",0.6,\" \"))))","v":{"v":1.1,"d":"1.10"}},{"v":0.9,"d":"0.90"},{"$f":"Tabla1[[#This Row],[Ancho ]]*(Tabla1[[#This Row],[Altura ]]^2)*Tabla1[[#This Row],[Factor Hoja]]","v":{"v":12.3469203,"d":"12.347"}},{"$f":"Tabla1[[#This Row],[Producción por ciclo ]]/(Tabla1[[#This Row],[Profundidad]]*Tabla1[[#This Row],[Ancho ]])","v":{"v":6.148160469667319,"d":"6.15"}},{"$f":"MROUND(3*Tabla1[[#This Row],[Longitud ]],10)","v":{"v":20,"d":"20.00"}},{"$f":"Tabla1[[#This Row],[Producción por ciclo ]]/(Tabla1[[#This Row],[dmin]]*Tabla1[[#This Row],[Ancho ]])","v":{"v":0.1570855,"d":"0.1571"}},{"$f":"IF(Tabla1[[#This Row],[Profundidad]]>Tabla1[[#This Row],[Profundidad de trabajo ]],\"Conforme\",\"No conforme\")","v":"Conforme"},{"$f":"Tabla1[[#This Row],[Densidad ]]*Tabla1[[#This Row],[Producción por ciclo ]]","v":{"v":18643.849653,"d":"18643.85"}},{"v":0.1,"d":"0.10"},{"$f":"Tabla1[[#This Row],[Peso ]]+Tabla1[[#This Row],[Peso de material]]","v":{"v":58394.849653,"d":"58394.85"}},{"$f":"(Tabla1[[#This Row],[Factor de tracción ]]*Tabla1[[#This Row],[Carga total]])/1000","v":{"v":52.5553646877,"d":"52.56"}},0.51,{"v":1.3,"d":"1.30"},{"$f":"Tabla1[[#This Row],[dmin]]/(Tabla1[[#This Row],[Velod. Avance]]*1000/60)","v":{"v":2.3529411764705883,"d":"2.35"}},{"$f":"Tabla1[[#This Row],[dmin]]/(Tabla1[[#This Row],[Velod. Retroceso]]*1000/60)","v":{"v":0.923076923076923,"d":"0.92"}},{"$f":"Tabla1[[#This Row],[Power shift]]+Tabla1[[#This Row],[T. Avance]]+Tabla1[[#This Row],[T. Retroceso]]","v":{"v":3.3760180995475113,"d":"3.38"}},0.69,{"$f":"(Tabla1[[#This Row],[Producción por ciclo ]]*60*Tabla1[[#This Row],[Eficiencia]])/Tabla1[[#This Row],[Cm]]","v":{"v":151.40988150759952,"d":"151.41"}}]
["D8T ",{"v":39751,"d":"39751.00"},"Semi universal",{"v":6.39,"d":"6.390"},{"v":3.93,"d":"3.930"},{"v":1.69,"d":"1.690"},0.511,"Tierra suelta ",{"v":1250,"d":"1250.00"},"Empuje facil",{"$f":"IF(Tabla1[[#This Row],[Nivel de empuje]]=\"Empuje facil\",1.1,IF(Tabla1[[#This Row],[Nivel de empuje]]=\"Empuje promedio\",0.9,IF(Tabla1[[#This Row],[Nivel de empuje]]=\"Empuje medio dificultoso\",0.7,IF(Tabla1[[#This Row],[Nivel de empuje]]=\"Empuje dificultoso\",0.6,\" \"))))","v":{"v":1.1,"d":"1.10"}},{"v":0.6,"d":"0.60"},{"$f":"Tabla1[[#This Row],[Ancho ]]*(Tabla1[[#This Row],[Altura ]]^2)*Tabla1[[#This Row],[Factor Hoja]]","v":{"v":12.3469203,"d":"12.347"}},{"$f":"Tabla1[[#This Row],[Producción por ciclo ]]/(Tabla1[[#This Row],[Profundidad]]*Tabla1[[#This Row],[Ancho ]])","v":{"v":6.148160469667319,"d":"6.15"}},{"$f":"MROUND(3*Tabla1[[#This Row],[Longitud ]],10)","v":{"v":20,"d":"20.00"}},{"$f":"Tabla1[[#This Row],[Producción por ciclo ]]/(Tabla1[[#This Row],[dmin]]*Tabla1[[#This Row],[Ancho ]])","v":{"v":0.1570855,"d":"0.1571"}},{"$f":"IF(Tabla1[[#This Row],[Profundidad]]>Tabla1[[#This Row],[Profundidad de trabajo ]],\"Conforme\",\"No conforme\")","v":"Conforme"},{"$f":"Tabla1[[#This Row],[Densidad ]]*Tabla1[[#This Row],[Producción por ciclo ]]","v":{"v":15433.650375000001,"d":"15433.65"}},{"v":0.1,"d":"0.10"},{"$f":"Tabla1[[#This Row],[Peso ]]+Tabla1[[#This Row],[Peso de material]]","v":{"v":55184.650375,"d":"55184.65"}},{"$f":"(Tabla1[[#This Row],[Factor de tracción ]]*Tabla1[[#This Row],[Carga total]])/1000","v":{"v":33.110790224999995,"d":"33.11"}},1.71,{"v":1.3,"d":"1.30"},{"$f":"Tabla1[[#This Row],[dmin]]/(Tabla1[[#This Row],[Velod. Avance]]*1000/60)","v":{"v":0.7017543859649122,"d":"0.70"}},{"$f":"Tabla1[[#This Row],[dmin]]/(Tabla1[[#This Row],[Velod. Retroceso]]*1000/60)","v":{"v":0.923076923076923,"d":"0.92"}},{"$f":"Tabla1[[#This Row],[Power shift]]+Tabla1[[#This Row],[T. Avance]]+Tabla1[[#This Row],[T. Retroceso]]","v":{"v":1.7248313090418352,"d":"1.72"}},0.69,{"$f":"(Tabla1[[#This Row],[Producción por ciclo ]]*60*Tabla1[[#This Row],[Eficiencia]])/Tabla1[[#This Row],[Cm]]","v":{"v":296.3550683132932,"d":"296.36"}}]
["D8T ",{"v":39751,"d":"39751.00"},"Semi universal",{"v":6.39,"d":"6.390"},{"v":3.93,"d":"3.930"},{"v":1.69,"d":"1.690"},0.511,"Carbón ",{"v":1190,"d":"1190.00"},"Empuje promedio",{"$f":"IF(Tabla1[[#This Row],[Nivel de empuje]]=\"Empuje facil\",1.1,IF(Tabla1[[#This Row],[Nivel de empuje]]=\"Empuje promedio\",0.9,IF(Tabla1[[#This Row],[Nivel de empuje]]=\"Empuje medio dificultoso\",0.7,IF(Tabla1[[#This Row],[Nivel de empuje]]=\"Empuje dificultoso\",0.6,\" \"))))","v":{"v":0.9,"d":"0.90"}},{"v":0.6,"d":"0.60"},{"$f":"Tabla1[[#This Row],[Ancho ]]*(Tabla1[[#This Row],[Altura ]]^2)*Tabla1[[#This Row],[Factor Hoja]]","v":{"v":10.1020257,"d":"10.102"}},{"$f":"Tabla1[[#This Row],[Producción por ciclo ]]/(Tabla1[[#This Row],[Profundidad]]*Tabla1[[#This Row],[Ancho ]])","v":{"v":5.030313111545988,"d":"5.03"}},{"$f":"MROUND(3*Tabla1[[#This Row],[Longitud ]],10)","v":{"v":20,"d":"20.00"}},{"$f":"Tabla1[[#This Row],[Producción por ciclo ]]/(Tabla1[[#This Row],[dmin]]*Tabla1[[#This Row],[Ancho ]])","v":{"v":0.12852449999999999,"d":"0.1285"}},{"$f":"IF(Tabla1[[#This Row],[Profundidad]]>Tabla1[[#This Row],[Profundidad de trabajo ]],\"Conforme\",\"No conforme\")","v":"Conforme"},{"$f":"Tabla1[[#This Row],[Densidad ]]*Tabla1[[#This Row],[Producción por ciclo ]]","v":{"v":12021.410583,"d":"12021.41"}},{"v":0.1,"d":"0.10"},{"$f":"Tabla1[[#This Row],[Peso ]]+Tabla1[[#This Row],[Peso de material]]","v":{"v":51772.410583000004,"d":"51772.41"}},{"$f":"(Tabla1[[#This Row],[Factor de tracción ]]*Tabla1[[#This Row],[Carga total]])/1000","v":{"v":31.0634463498,"d":"31.06"}},1.85,{"v":1.3,"d":"1.30"},{"$f":"Tabla1[[#This Row],[dmin]]/(Tabla1[[#This Row],[Velod. Avance]]*1000/60)","v":{"v":0.6486486486486487,"d":"0.65"}},{"$f":"Tabla1[[#This Row],[dmin]]/(Tabla1[[#This Row],[Velod. Retroceso]]*1000/60)","v":{"v":0.923076923076923,"d":"0.92"}},{"$f":"Tabla1[[#This Row],[Power shift]]+Tabla1[[#This Row],[T. Avance]]+Tabla1[[#This Row],[T. Retroceso]]","v":{"v":1.6717255717255717,"d":"1.67"}},0.69,{"$f":"(Tabla1[[#This Row],[Producción por ciclo ]]*60*Tabla1[[#This Row],[Eficiencia]])/Tabla1[[#This Row],[Cm]]","v":{"v":250.17495159107077,"d":"250.17"}}]
["D8T ",{"v":39751,"d":"39751.00"},"Universal ",{"v":6.79,"d":"6.790"},{"v":4.25,"d":"4.250"},{"v":1.74,"d":"1.740"},0.567,"Concreto ",{"v":2400,"d":"2400.00"},"Empuje dificultoso",{"$f":"IF(Tabla1[[#This Row],[Nivel de empuje]]=\"Empuje facil\",1.1,IF(Tabla1[[#This Row],[Nivel de empuje]]=\"Empuje promedio\",0.9,IF(Tabla1[[#This Row],[Nivel de empuje]]=\"Empuje medio dificultoso\",0.7,IF(Tabla1[[#This Row],[Nivel de empuje]]=\"Empuje dificultoso\",0.6,\" \"))))","v":{"v":0.6,"d":"0.60"}},0.45,{"$f":"Tabla1[[#This Row],[Ancho ]]*(Tabla1[[#This Row],[Altura ]]^2)*Tabla1[[#This Row],[Factor Hoja]]","v":{"v":7.72038,"d":"7.720"}},{"$f":"Tabla1[[#This Row],[Producción por ciclo ]]/(Tabla1[[#This Row],[Profundidad]]*Tabla1[[#This Row],[Ancho ]])","v":{"v":3.203809523809524,"d":"3.20"}},{"$f":"MROUND(3*Tabla1[[#This Row],[Longitud ]],10)","v":{"v":20,"d":"20.00"}},{"$f":"Tabla1[[#This Row],[Producción por ciclo ]]/(Tabla1[[#This Row],[dmin]]*Tabla1[[#This Row],[Ancho ]])","v":{"v":0.09082799999999999,"d":"0.0908"}},{"$f":"IF(Tabla1[[#This Row],[Profundidad]]>Tabla1[[#This Row],[Profundidad de trabajo ]],\"Conforme\",\"No conforme\")","v":"Conforme"},{"$f":"Tabla1[[#This Row],[Densidad ]]*Tabla1[[#This Row],[Producción por ciclo ]]","v":{"v":18528.912,"d":"18528.91"}},{"v":0.1,"d":"0.10"},{"$f":"Tabla1[[#This Row],[Peso ]]+Tabla1[[#This Row],[Peso de material]]","v":{"v":58279.912,"d":"58279.91"}},{"$f":"(Tabla1[[#This Row],[Factor de tracción ]]*Tabla1[[#This Row],[Carga total]])/1000","v":{"v":26.225960399999998,"d":"26.23"}},2.09,{"v":1.3,"d":"1.30"},{"$f":"Tabla1[[#This Row],[dmin]]/(Tabla1[[#This Row],[Velod. Avance]]*1000/60)","v":{"v":0.5741626794258373,"d":"0.57"}},{"$f":"Tabla1[[#This Row],[dmin]]/(Tabla1[[#This Row],[Velod. Retroceso]]*1000/60)","v":{"v":0.923076923076923,"d":"0.92"}},{"$f":"Tabla1[[#This Row],[Power shift]]+Tabla1[[#This Row],[T. Avance]]+Tabla1[[#This Row],[T. Retroceso]]","v":{"v":1.5972396025027602,"d":"1.60"}},0.69,{"$f":"(Tabla1[[#This Row],[Producción por ciclo ]]*60*Tabla1[[#This Row],[Eficiencia]])/Tabla1[[#This Row],[Cm]]","v":{"v":200.11007208885408,"d":"200.11"}}]
["D8T ",{"v":39751,"d":"39751.00"},"Universal ",{"v":6.79,"d":"6.790"},{"v":4.25,"d":"4.250"},{"v":1.74,"d":"1.740"},0.567,"Arcilla seca ",{"v":1480,"d":"1480.00"},"Empuje medio dificultoso",{"$f":"IF(Tabla1[[#This Row],[Nivel de empuje]]=\"Empuje facil\",1.1,IF(Tabla1[[#This Row],[Nivel de empuje]]=\"Empuje promedio\",0.9,IF(Tabla1[[#This Row],[Nivel de empuje]]=\"Empuje medio dificultoso\",0.7,IF(Tabla1[[#This Row],[Nivel de empuje]]=\"Empuje dificultoso\",0.6,\" \"))))","v":{"v":0.7,"d":"0.70"}},{"v":0.9,"d":"0.90"},{"$f":"Tabla1[[#This Row],[Ancho ]]*(Tabla1[[#This Row],[Altura ]]^2)*Tabla1[[#This Row],[Factor Hoja]]","v":{"v":9.007109999999999,"d":"9.007"}},{"$f":"Tabla1[[#This Row],[Producción por ciclo ]]/(Tabla1[[#This Row],[Profundidad]]*Tabla1[[#This Row],[Ancho ]])","v":{"v":3.7377777777777776,"d":"3.74"}},{"$f":"MROUND(3*Tabla1[[#This Row],[Longitud ]],10)","v":{"v":20,"d":"20.00"}},{"$f":"Tabla1[[#This Row],[Producción por ciclo ]]/(Tabla1[[#This Row],[dmin]]*Tabla1[[#This Row],[Ancho ]])","v":{"v":0.10596599999999999,"d":"0.1060"}},{"$f":"IF(Tabla1[[#This Row],[Profundidad]]>Tabla1[[#This Row],[Profundidad de trabajo ]],\"Conforme\",\"No conforme\")","v":"Conforme"},{"$f":"Tabla1[[#This Row],[Densidad ]]*Tabla1[[#This Row],[Producción por ciclo ]]","v":{"v":13330.522799999999,"d":"13330.52"}},{"v":0.1,"d":"0.10"},{"$f":"Tabla1[[#This Row],[Peso ]]+Tabla1[[#This Row],[Peso de material]]","v":{"v":53081.5228,"d":"53081.52"}},{"$f":"(Tabla1[[#This Row],[Factor de tracción ]]*Tabla1[[#This Row],[Carga total]])/1000","v":{"v":47.77337052,"d":"47.77"}},0.75,{"v":1.3,"d":"1.30"},{"$f":"Tabla1[[#This Row],[dmin]]/(Tabla1[[#This Row],[Velod. Avance]]*1000/60)","v":{"v":1.6,"d":"1.60"}},{"$f":"Tabla1[[#This Row],[dmin]]/(Tabla1[[#This Row],[Velod. Retroceso]]*1000/60)","v":{"v":0.923076923076923,"d":"0.92"}},{"$f":"Tabla1[[#This Row],[Power shift]]+Tabla1[[#This Row],[T. Avance]]+Tabla1[[#This Row],[T. Retroceso]]","v":{"v":2.623076923076923,"d":"2.62"}},0.69,{"$f":"(Tabla1[[#This Row],[Producción por ciclo ]]*60*Tabla1[[#This Row],[Eficiencia]])/Tabla1[[#This Row],[Cm]]","v":{"v":142.159137888563,"d":"142.16"}}]
["D8T ",{"v":39751,"d":"39751.00"},"Universal ",{"v":6.79,"d":"6.790"},{"v":4.25,"d":"4.250"},{"v":1.74,"d":"1.740"},0.567,"Arcilla húmeda",{"v":1660,"d":"1660.00"},"Empuje facil",{"$f":"IF(Tabla1[[#This Row],[Nivel de empuje]]=\"Empuje facil\",1.1,IF(Tabla1[[#This Row],[Nivel de empuje]]=\"Empuje promedio\",0.9,IF(Tabla1[[#This Row],[Nivel de empuje]]=\"Empuje medio dificultoso\",0.7,IF(Tabla1[[#This Row],[Nivel de empuje]]=\"Empuje dificultoso\",0.6,\" \"))))","v":{"v":1.1,"d":"1.10"}},{"v":0.7,"d":"0.70"},{"$f":"Tabla1[[#This Row],[Ancho ]]*(Tabla1[[#This Row],[Altura ]]^2)*Tabla1[[#This Row],[Factor Hoja]]","v":{"v":14.15403,"d":"14.154"}},{"$f":"Tabla1[[#This Row],[Producción por ciclo ]]/(Tabla1[[#This Row],[Profundidad]]*Tabla1[[#This Row],[Ancho ]])","v":{"v":5.8736507936507945,"d":"5.87"}},{"$f":"MROUND(3*Tabla1[[#This Row],[Longitud ]],10)","v":{"v":20,"d":"20.00"}},{"$f":"Tabla1[[#This Row],[Producción por ciclo ]]/(Tabla1[[#This Row],[dmin]]*Tabla1[[#This Row],[Ancho ]])","v":{"v":0.166518,"d":"0.1665"}},{"$f":"IF(Tabla1[[#This Row],[Profundidad]]>Tabla1[[#This Row],[Profundidad de trabajo ]],\"Conforme\",\"No conforme\")","v":"Conforme"},{"$f":"Tabla1[[#This Row],[Densidad ]]*Tabla1[[#This Row],[Producción por ciclo ]]","v":{"v":23495.6898,"d":"23495.69"}},{"v":0.1,"d":"0.10"},{"$f":"Tabla1[[#This Row],[Peso ]]+Tabla1[[#This Row],[Peso de material]]","v":{"v":63246.6898,"d":"63246.69"}},{"$f":"(Tabla1[[#This Row],[Factor de tracción ]]*Tabla1[[#This Row],[Carga total]])/1000","v":{"v":44.27268286,"d":"44.27"}},1.02,{"v":1.3,"d":"1.30"},{"$f":"Tabla1[[#This Row],[dmin]]/(Tabla1[[#This Row],[Velod. Avance]]*1000/60)","v":{"v":1.1764705882352942,"d":"1.18"}},{"$f":"Tabla1[[#This Row],[dmin]]/(Tabla1[[#This Row],[Velod. Retroceso]]*1000/60)","v":{"v":0.923076923076923,"d":"0.92"}},{"$f":"Tabla1[[#This Row],[Power shift]]+Tabla1[[#This Row],[T. Avance]]+Tabla1[[#This Row],[T. Retroceso]]","v":{"v":2.1995475113122174,"d":"2.20"}},0.69,{"$f":"(Tabla1[[#This Row],[Producción por ciclo ]]*60*Tabla1[[#This Row],[Eficiencia]])/Tabla1[[#This Row],[Cm]]","v":{"v":266.4079038922032,"d":"266.41"}}]
["D8T ",{"v":39751,"d":"39751.00"},"Universal ",{"v":6.79,"d":"6.790"},{"v":4.25,"d":"4.250"},{"v":1.74,"d":"1.740"},0.567,"Arena seca ",{"v":1420,"d":"1420.00"},"Empuje facil",{"$f":"IF(Tabla1[[#This Row],[Nivel de empuje]]=\"Empuje facil\",1.1,IF(Tabla1[[#This Row],[Nivel de empuje]]=\"Empuje promedio\",0.9,IF(Tabla1[[#This Row],[Nivel de empuje]]=\"Empuje medio dificultoso\",0.7,IF(Tabla1[[#This Row],[Nivel de empuje]]=\"Empuje dificultoso\",0.6,\" \"))))","v":{"v":1.1,"d":"1.10"}},0.39,{"$f":"Tabla1[[#This Row],[Ancho ]]*(Tabla1[[#This Row],[Altura ]]^2)*Tabla1[[#This Row],[Factor Hoja]]","v":{"v":14.15403,"d":"14.154"}},{"$f":"Tabla1[[#This Row],[Producción por ciclo ]]/(Tabla1[[#This Row],[Profundidad]]*Tabla1[[#This Row],[Ancho ]])","v":{"v":5.8736507936507945,"d":"5.87"}},{"$f":"MROUND(3*Tabla1[[#This Row],[Longitud ]],10)","v":{"v":20,"d":"20.00"}},{"$f":"Tabla1[[#This Row],[Producción por ciclo ]]/(Tabla1[[#This Row],[dmin]]*Tabla1[[#This Row],[Ancho ]])","v":{"v":0.166518,"d":"0.1665"}},{"$f":"IF(Tabla1[[#This Row],[Profundidad]]>Tabla1[[#This Row],[Profundidad de trabajo ]],\"Conforme\",\"No conforme\")","v":"Conforme"},{"$f":"Tabla1[[#This Row],[Densidad ]]*Tabla1[[#This Row],[Producción por ciclo ]]","v":{"v":20098.7226,"d":"20098.72"}},{"v":0.1,"d":"0.10"},{"$f":"Tabla1[[#This Row],[Peso ]]+Tabla1[[#This Row],[Peso de material]]","v":{"v":59849.7226,"d":"59849.72"}},{"$f":"(Tabla1[[#This Row],[Factor de tracción ]]*Tabla1[[#This Row],[Carga total]])/1000","v":{"v":23.341391814,"d":"23.34"}},2.45,{"v":1.3,"d":"1.30"},{"$f":"Tabla1[[#This Row],[dmin]]/(Tabla1[[#This Row],[Velod. Avance]]*1000/60)","v":{"v":0.4897959183673469,"d":"0.49"}},{"$f":"Tabla1[[#This Row],[dmin]]/(Tabla1[[#This Row],[Velod. Retroceso]]*1000/60)","v":{"v":0.923076923076923,"d":"0.92"}},{"$f":"Tabla1[[#This Row],[Power shift]]+Tabla1[[#This Row],[T. Avance]]+Tabla1[[#This Row],[T. Retroceso]]","v":{"v":1.51287284144427,"d":"1.51"}},0.69,{"$f":"(Tabla1[[#This Row],[Producción por ciclo ]]*60*Tabla1[[#This Row],[Eficiencia]])/Tabla1[[#This Row],[Cm]]","v":{"v":387.32722668257753,"d":"387.33"}}]
["D8T ",{"v":39751,"d":"39751.00"},"Universal ",{"v":6.79,"d":"6.790"},{"v":4.25,"d":"4.250"},{"v":1.74,"d":"1.740"},0.567,"Arena húmeda ",{"v":1690,"d":"1690.00"},"Empuje medio dificultoso",{"$f":"IF(Tabla1[[#This Row],[Nivel de empuje]]=\"Empuje facil\",1.1,IF(Tabla1[[#This Row],[Nivel de empuje]]=\"Empuje promedio\",0.9,IF(Tabla1[[#This Row],[Nivel de empuje]]=\"Empuje medio dificultoso\",0.7,IF(Tabla1[[#This Row],[Nivel de empuje]]=\"Empuje dificultoso\",0.6,\" \"))))","v":{"v":0.7,"d":"0.70"}},{"v":0.5,"d":"0.50"},{"$f":"Tabla1[[#This Row],[Ancho ]]*(Tabla1[[#This Row],[Altura ]]^2)*Tabla1[[#This Row],[Factor Hoja]]","v":{"v":9.007109999999999,"d":"9.007"}},{"$f":"Tabla1[[#This Row],[Producción por ciclo ]]/(Tabla1[[#This Row],[Profundidad]]*Tabla1[[#This Row],[Ancho ]])","v":{"v":3.7377777777777776,"d":"3.74"}},{"$f":"MROUND(3*Tabla1[[#This Row],[Longitud ]],10)","v":{"v":20,"d":"20.00"}},{"$f":"Tabla1[[#This Row],[Producción por ciclo ]]/(Tabla1[[#This Row],[dmin]]*Tabla1[[#This Row],[Ancho ]])","v":{"v":0.10596599999999999,"d":"0.1060"}},{"$f":"IF(Tabla1[[#This Row],[Profundidad]]>Tabla1[[#This Row],[Profundidad de trabajo ]],\"Conforme\",\"No conforme\")","v":"Conforme"},{"$f":"Tabla1[[#This Row],[Densidad ]]*Tabla1[[#This Row],[Producción por ciclo ]]","v":{"v":15222.015899999999,"d":"15222.02"}},{"v":0.1,"d":"0.10"},{"$f":"Tabla1[[#This Row],[Peso ]]+Tabla1[[#This Row],[Peso de material]]","v":{"v":54973.0159,"d":"54973.02"}},{"$f":"(Tabla1[[#This Row],[Factor de tracción ]]*Tabla1[[#This Row],[Carga total]])/1000","v":{"v":27.48650795,"d":"27.49"}},2.09,{"v":1.3,"d":"1.30"},{"$f":"Tabla1[[#This Row],[dmin]]/(Tabla1[[#This Row],[Velod. Avance]]*1000/60)","v":{"v":0.5741626794258373,"d":"0.57"}},{"$f":"Tabla1[[#This Row],[dmin]]/(Tabla1[[#This Row],[Velod. Retroceso]]*1000/60)","v":{"v":0.923076923076923,"d":"0.92"}},{"$f":"Tabla1[[#This Row],[Power shift]]+Tabla1[[#This Row],[T. Avance]]+Tabla1[[#This Row],[T. Retroceso]]","v":{"v":1.5972396025027602,"d":"1.60"}},0.69,{"$f":"(Tabla1[[#This Row],[Producción por ciclo ]]*60*Tabla1[[#This Row],[Eficiencia]])/Tabla1[[#This Row],[Cm]]","v":{"v":233.46175077032973,"d":"233.46"}}]
["D8T ",{"v":39751,"d":"39751.00"},"Universal ",{"v":6.79,"d":"6.790"},{"v":4.25,"d":"4.250"},{"v":1.74,"d":"1.740"},0.567,"Grava suelta ",{"v":1930,"d":"1930.00"},"Empuje promedio",{"$f":"IF(Tabla1[[#This Row],[Nivel de empuje]]=\"Empuje facil\",1.1,IF(Tabla1[[#This Row],[Nivel de empuje]]=\"Empuje promedio\",0.9,IF(Tabla1[[#This Row],[Nivel de empuje]]=\"Empuje medio dificultoso\",0.7,IF(Tabla1[[#This Row],[Nivel de empuje]]=\"Empuje dificultoso\",0.6,\" \"))))","v":{"v":0.9,"d":"0.90"}},{"v":0.5,"d":"0.50"},{"$f":"Tabla1[[#This Row],[Ancho ]]*(Tabla1[[#This Row],[Altura ]]^2)*Tabla1[[#This Row],[Factor Hoja]]","v":{"v":11.58057,"d":"11.581"}},{"$f":"Tabla1[[#This Row],[Producción por ciclo ]]/(Tabla1[[#This Row],[Profundidad]]*Tabla1[[#This Row],[Ancho ]])","v":{"v":4.805714285714286,"d":"4.81"}},{"$f":"MROUND(3*Tabla1[[#This Row],[Longitud ]],10)","v":{"v":20,"d":"20.00"}},{"$f":"Tabla1[[#This Row],[Producción por ciclo ]]/(Tabla1[[#This Row],[dmin]]*Tabla1[[#This Row],[Ancho ]])","v":{"v":0.136242,"d":"0.1362"}},{"$f":"IF(Tabla1[[#This Row],[Profundidad]]>Tabla1[[#This Row],[Profundidad de trabajo ]],\"Conforme\",\"No conforme\")","v":"Conforme"},{"$f":"Tabla1[[#This Row],[Densidad ]]*Tabla1[[#This Row],[Producción por ciclo ]]","v":{"v":22350.5001,"d":"22350.50"}},{"v":0.1,"d":"0.10"},{"$f":"Tabla1[[#This Row],[Peso ]]+Tabla1[[#This Row],[Peso de material]]","v":{"v":62101.500100000005,"d":"62101.50"}},{"$f":"(Tabla1[[#This Row],[Factor de tracción ]]*Tabla1[[#This Row],[Carga total]])/1000","v":{"v":31.05075005,"d":"31.05"}},1.84,{"v":1.3,"d":"1.30"},{"$f":"Tabla1[[#This Row],[dmin]]/(Tabla1[[#This Row],[Velod. Avance]]*1000/60)","v":{"v":0.6521739130434783,"d":"0.65"}},{"$f":"Tabla1[[#This Row],[dmin]]/(Tabla1[[#This Row],[Velod. Retroceso]]*1000/60)","v":{"v":0.923076923076923,"d":"0.92"}},{"$f":"Tabla1[[#This Row],[Power shift]]+Tabla1[[#This Row],[T. Avance]]+Tabla1[[#This Row],[T. Retroceso]]","v":{"v":1.6752508361204013,"d":"1.68"}},0.69,{"$f":"(Tabla1[[#This Row],[Producción por ciclo ]]*60*Tabla1[[#This Row],[Eficiencia]])/Tabla1[[#This Row],[Cm]]","v":{"v":286.187350373328,"d":"286.19"}}]
["D8T ",{"v":39751,"d":"39751.00"},"Universal ",{"v":6.79,"d":"6.790"},{"v":4.25,"d":"4.250"},{"v":1.74,"d":"1.740"},0.567,"Nieve compacta",{"v":130,"d":"130.00"},"Empuje medio dificultoso",{"$f":"IF(Tabla1[[#This Row],[Nivel de empuje]]=\"Empuje facil\",1.1,IF(Tabla1[[#This Row],[Nivel de empuje]]=\"Empuje promedio\",0.9,IF(Tabla1[[#This Row],[Nivel de empuje]]=\"Empuje medio dificultoso\",0.7,IF(Tabla1[[#This Row],[Nivel de empuje]]=\"Empuje dificultoso\",0.6,\" \"))))","v":{"v":0.7,"d":"0.70"}},0.27,{"$f":"Tabla1[[#This Row],[Ancho ]]*(Tabla1[[#This Row],[Altura ]]^2)*Tabla1[[#This Row],[Factor Hoja]]","v":{"v":9.007109999999999,"d":"9.007"}},{"$f":"Tabla1[[#This Row],[Producción por ciclo ]]/(Tabla1[[#This Row],[Profundidad]]*Tabla1[[#This Row],[Ancho ]])","v":{"v":3.7377777777777776,"d":"3.74"}},{"$f":"MROUND(3*Tabla1[[#This Row],[Longitud ]],10)","v":{"v":20,"d":"20.00"}},{"$f":"Tabla1[[#This Row],[Producción por ciclo ]]/(Tabla1[[#This Row],[dmin]]*Tabla1[[#This Row],[Ancho ]])","v":{"v":0.10596599999999999,"d":"0.1060"}},{"$f":"IF(Tabla1[[#This Row],[Profundidad]]>Tabla1[[#This Row],[Profundidad de trabajo ]],\"Conforme\",\"No conforme\")","v":"Conforme"},{"$f":"Tabla1[[#This Row],[Densidad ]]*Tabla1[[#This Row],[Producción por ciclo ]]","v":{"v":1170.9243,"d":"1170.92"}},{"v":0.1,"d":"0.10"},{"$f":"Tabla1[[#This Row],[Peso ]]+Tabla1[[#This Row],[Peso de material]]","v":{"v":40921.9243,"d":"40921.92"}},{"$f":"(Tabla1[[#This Row],[Factor de tracción ]]*Tabla1[[#This Row],[Carga total]])/1000","v":{"v":11.048919561,"d":"11.05"}},4.89,{"v":1.3,"d":"1.30"},{"$f":"Tabla1[[#This Row],[dmin]]/(Tabla1[[#This Row],[Velod. Avance]]*1000/60)","v":{"v":0.24539877300613497,"d":"0.25"}},{"$f":"Tabla1[[#This Row],[dmin]]/(Tabla1[[#This Row],[Velod. Retroceso]]*1000/60)","v":{"v":0.923076923076923,"d":"0.92"}},{"$f":"Tabla1[[#This Row],[Power shift]]+Tabla1[[#This Row],[T. Avance]]+Tabla1[[#This Row],[T. Retroceso]]","v":{"v":1.2684756960830579,"d":"1.27"}},0.69,{"$f":"(Tabla1[[#This Row],[Producción por ciclo ]]*60*Tabla1[[#This Row],[Eficiencia]])/Tabla1[[#This Row],[Cm]]","v":{"v":293.9704364470404,"d":"293.97"}}]
["D8T ",{"v":39751,"d":"39751.00"},"Universal ",{"v":6.79,"d":"6.790"},{"v":4.25,"d":"4.250"},{"v":1.74,"d":"1.740"},0.567,"Hielo ",{"v":520,"d":"520.00"},"Empuje dificultoso",{"$f":"IF(Tabla1[[#This Row],[Nivel de empuje]]=\"Empuje facil\",1.1,IF(Tabla1[[#This Row],[Nivel de empuje]]=\"Empuje promedio\",0.9,IF(Tabla1[[#This Row],[Nivel de empuje]]=\"Empuje medio dificultoso\",0.7,IF(Tabla1[[#This Row],[Nivel de empuje]]=\"Empuje dificultoso\",0.6,\" \"))))","v":{"v":0.6,"d":"0.60"}},0.12,{"$f":"Tabla1[[#This Row],[Ancho ]]*(Tabla1[[#This Row],[Altura ]]^2)*Tabla1[[#This Row],[Factor Hoja]]","v":{"v":7.72038,"d":"7.720"}},{"$f":"Tabla1[[#This Row],[Producción por ciclo ]]/(Tabla1[[#This Row],[Profundidad]]*Tabla1[[#This Row],[Ancho ]])","v":{"v":3.203809523809524,"d":"3.20"}},{"$f":"MROUND(3*Tabla1[[#This Row],[Longitud ]],10)","v":{"v":20,"d":"20.00"}},{"$f":"Tabla1[[#This Row],[Producción por ciclo ]]/(Tabla1[[#This Row],[dmin]]*Tabla1[[#This Row],[Ancho ]])","v":{"v":0.09082799999999999,"d":"0.0908"}},{"$f":"IF(Tabla1[[#This Row],[Profundidad]]>Tabla1[[#This Row],[Profundidad de trabajo ]],\"Conforme\",\"No conforme\")","v":"Conforme"},{"$f":"Tabla1[[#This Row],[Densidad ]]*Tabla1[[#This Row],[Producción por ciclo ]]","v":{"v":4014.5975999999996,"d":"4014.60"}},{"v":0.1,"d":"0.10"},{"$f":"Tabla1[[#This Row],[Peso ]]+Tabla1[[#This Row],[Peso de material]]","v":{"v":43765.5976,"d":"43765.60"}},{"$f":"(Tabla1[[#This Row],[Factor de tracción ]]*Tabla1[[#This Row],[Carga total]])/1000","v":{"v":5.251871712,"d":"5.25"}},9.28,{"v":1.3,"d":"1.30"},{"$f":"Tabla1[[#This Row],[dmin]]/(Tabla1[[#This Row],[Velod. Avance]]*1000/60)","v":{"v":0.12931034482758622,"d":"0.13"}},{"$f":"Tabla1[[#This Row],[dmin]]/(Tabla1[[#This Row],[Velod. Retroceso]]*1000/60)","v":{"v":0.923076923076923,"d":"0.92"}},{"$f":"Tabla1[[#This Row],[Power shift]]+Tabla1[[#This Row],[T. Avance]]+Tabla1[[#This Row],[T. Retroceso]]","v":{"v":1.1523872679045093,"d":"1.15"}},0.69,{"$f":"(Tabla1[[#This Row],[Producción por ciclo ]]*60*Tabla1[[#This Row],[Eficiencia]])/Tabla1[[#This Row],[Cm]]","v":{"v":277.35791682357,"d":"277.36"}}]
["D8T ",{"v":39751,"d":"39751.00"},"Universal ",{"v":6.79,"d":"6.790"},{"v":4.25,"d":"4.250"},{"v":1.74,"d":"1.740"},0.567,"Tierra firme ",{"v":1510,"d":"1510.00"},"Empuje facil",{"$f":"IF(Tabla1[[#This Row],[Nivel de empuje]]=\"Empuje facil\",1.1,IF(Tabla1[[#This Row],[Nivel de empuje]]=\"Empuje promedio\",0.9,IF(Tabla1[[#This Row],[Nivel de empuje]]=\"Empuje medio dificultoso\",0.7,IF(Tabla1[[#This Row],[Nivel de empuje]]=\"Empuje dificultoso\",0.6,\" \"))))","v":{"v":1.1,"d":"1.10"}},{"v":0.9,"d":"0.90"},{"$f":"Tabla1[[#This Row],[Ancho ]]*(Tabla1[[#This Row],[Altura ]]^2)*Tabla1[[#This Row],[Factor Hoja]]","v":{"v":14.15403,"d":"14.154"}},{"$f":"Tabla1[[#This Row],[Producción por ciclo ]]/(Tabla1[[#This Row],[Profundidad]]*Tabla1[[#This Row],[Ancho ]])","v":{"v":5.8736507936507945,"d":"5.87"}},{"$f":"MROUND(3*Tabla1[[#This Row],[Longitud ]],10)","v":{"v":20,"d":"20.00"}},{"$f":"Tabla1[[#This Row],[Producción por ciclo ]]/(Tabla1[[#This Row],[dmin]]*Tabla1[[#This Row],[Ancho ]])","v":{"v":0.166518,"d":"0.1665"}},{"$f":"IF(Tabla1[[#This Row],[Profundidad]]>Tabla1[[#This Row],[Profundidad de trabajo ]],\"Conforme\",\"No conforme\")","v":"Conforme"},{"$f":"Tabla1[[#This Row],[Densidad ]]*Tabla1[[#This Row],[Producción por ciclo ]]","v":{"v":21372.585300000002,"d":"21372.59"}},{"v":0.1,"d":"0.10"},{"$f":"Tabla1[[#This Row],[Peso ]]+Tabla1[[#This Row],[Peso de material]]","v":{"v":61123.585300000006,"d":"61123.59"}},{"$f":"(Tabla1[[#This Row],[Factor de tracción ]]*Tabla1[[#This Row],[Carga total]])/1000","v":{"v":55.01122677000001,"d":"55.01"}},0.49,{"v":1.3,"d":"1.30"},{"$f":"Tabla1[[#This Row],[dmin]]/(Tabla1[[#This Row],[Velod. Avance]]*1000/60)","v":{"v":2.4489795918367347,"d":"2.45"}},{"$f":"Tabla1[[#This Row],[dmin]]/(Tabla1[[#This Row],[Velod. Retroceso]]*1000/60)","v":{"v":0.923076923076923,"d":"0.92"}},{"$f":"Tabla1[[#This Row],[Power shift]]+Tabla1[[#This Row],[T. Avance]]+Tabla1[[#This Row],[T. Retroceso]]","v":{"v":3.4720565149136577,"d":"3.47"}},0.69,{"$f":"(Tabla1[[#This Row],[Producción por ciclo ]]*60*Tabla1[[#This Row],[Eficiencia]])/Tabla1[[#This Row],[Cm]]","v":{"v":168.7693847963105,"d":"168.77"}}]
["D8T ",{"v":39751,"d":"39751.00"},"Universal ",{"v":6.79,"d":"6.790"},{"v":4.25,"d":"4.250"},{"v":1.74,"d":"1.740"},0.567,"Tierra suelta ",{"v":1250,"d":"1250.00"},"Empuje facil",{"$f":"IF(Tabla1[[#This Row],[Nivel de empuje]]=\"Empuje facil\",1.1,IF(Tabla1[[#This Row],[Nivel de empuje]]=\"Empuje promedio\",0.9,IF(Tabla1[[#This Row],[Nivel de empuje]]=\"Empuje medio dificultoso\",0.7,IF(Tabla1[[#This Row],[Nivel de empuje]]=\"Empuje dificultoso\",0.6,\" \"))))","v":{"v":1.1,"d":"1.10"}},{"v":0.6,"d":"0.60"},{"$f":"Tabla1[[#This Row],[Ancho ]]*(Tabla1[[#This Row],[Altura ]]^2)*Tabla1[[#This Row],[Factor Hoja]]","v":{"v":14.15403,"d":"14.154"}},{"$f":"Tabla1[[#This Row],[Producción por ciclo ]]/(Tabla1[[#This Row],[Profundidad]]*Tabla1[[#This Row],[Ancho ]])","v":{"v":5.8736507936507945,"d":"5.87"}},{"$f":"MROUND(3*Tabla1[[#This Row],[Longitud ]],10)","v":{"v":20,"d":"20.00"}},{"$f":"Tabla1[[#This Row],[Producción por ciclo ]]/(Tabla1[[#This Row],[dmin]]*Tabla1[[#This Row],[Ancho ]])","v":{"v":0.166518,"d":"0.1665"}},{"$f":"IF(Tabla1[[#This Row],[Profundidad]]>Tabla1[[#This Row],[Profundidad de trabajo ]],\"Conforme\",\"No conforme\")","v":"Conforme"},{"$f":"Tabla1[[#This Row],[Densidad ]]*Tabla1[[#This Row],[Producción por ciclo ]]","v":{"v":17692.537500000002,"d":"17692.54"}},{"v":0.1,"d":"0.10"},{"$f":"Tabla1[[#This Row],[Peso ]]+Tabla1[[#This Row],[Peso de material]]","v":{"v":57443.537500000006,"d":"57443.54"}},{"$f":"(Tabla1[[#This Row],[Factor de tracción ]]*Tabla1[[#This Row],[Carga total]])/1000","v":{"v":34.466122500000004,"d":"34.47"}},1.71,{"v":1.3,"d":"1.30"},{"$f":"Tabla1[[#This Row],[dmin]]/(Tabla1[[#This Row],[Velod. Avance]]*1000/60)","v":{"v":0.7017543859649122,"d":"0.70"}},{"$f":"Tabla1[[#This Row],[dmin]]/(Tabla1[[#This Row],[Velod. Retroceso]]*1000/60)","v":{"v":0.923076923076923,"d":"0.92"}},{"$f":"Tabla1[[#This Row],[Power shift]]+Tabla1[[#This Row],[T. Avance]]+Tabla1[[#This Row],[T. Retroceso]]","v":{"v":1.7248313090418352,"d":"1.72"}},0.69,{"$f":"(Tabla1[[#This Row],[Producción por ciclo ]]*60*Tabla1[[#This Row],[Eficiencia]])/Tabla1[[#This Row],[Cm]]","v":{"v":339.7299428229403,"d":"339.73"}}]
["D8T ",{"v":39751,"d":"39751.00"},"Universal ",{"v":6.79,"d":"6.790"},{"v":4.25,"d":"4.250"},{"v":1.74,"d":"1.740"},0.567,"Carbón ",{"v":1190,"d":"1190.00"},"Empuje promedio",{"$f":"IF(Tabla1[[#This Row],[Nivel de empuje]]=\"Empuje facil\",1.1,IF(Tabla1[[#This Row],[Nivel de empuje]]=\"Empuje promedio\",0.9,IF(Tabla1[[#This Row],[Nivel de empuje]]=\"Empuje medio dificultoso\",0.7,IF(Tabla1[[#This Row],[Nivel de empuje]]=\"Empuje dificultoso\",0.6,\" \"))))","v":{"v":0.9,"d":"0.90"}},{"v":0.6,"d":"0.60"},{"$f":"Tabla1[[#This Row],[Ancho ]]*(Tabla1[[#This Row],[Altura ]]^2)*Tabla1[[#This Row],[Factor Hoja]]","v":{"v":11.58057,"d":"11.581"}},{"$f":"Tabla1[[#This Row],[Producción por ciclo ]]/(Tabla1[[#This Row],[Profundidad]]*Tabla1[[#This Row],[Ancho ]])","v":{"v":4.805714285714286,"d":"4.81"}},{"$f":"MROUND(3*Tabla1[[#This Row],[Longitud ]],10)","v":{"v":20,"d":"20.00"}},{"$f":"Tabla1[[#This Row],[Producción por ciclo ]]/(Tabla1[[#This Row],[dmin]]*Tabla1[[#This Row],[Ancho ]])","v":{"v":0.136242,"d":"0.1362"}},{"$f":"IF(Tabla1[[#This Row],[Profundidad]]>Tabla1[[#This Row],[Profundidad de trabajo ]],\"Conforme\",\"No conforme\")","v":"Conforme"},{"$f":"Tabla1[[#This Row],[Densidad ]]*Tabla1[[#This Row],[Producción por ciclo ]]","v":{"v":13780.8783,"d":"13780.88"}},{"v":0.1,"d":"0.10"},{"$f":"Tabla1[[#This Row],[Peso ]]+Tabla1[[#This Row],[Peso de material]]","v":{"v":53531.8783,"d":"53531.88"}},{"$f":"(Tabla1[[#This Row],[Factor de tracción ]]*Tabla1[[#This Row],[Carga total]])/1000","v":{"v":32.11912698,"d":"32.12"}},1.79,{"v":1.3,"d":"1.30"},{"$f":"Tabla1[[#This Row],[dmin]]/(Tabla1[[#This Row],[Velod. Avance]]*1000/60)","v":{"v":0.670391061452514,"d":"0.67"}},{"$f":"Tabla1[[#This Row],[dmin]]/(Tabla1[[#This Row],[Velod. Retroceso]]*1000/60)","v":{"v":0.923076923076923,"d":"0.92"}},{"$f":"Tabla1[[#This Row],[Power shift]]+Tabla1[[#This Row],[T. Avance]]+Tabla1[[#This Row],[T. Retroceso]]","v":{"v":1.6934679845294371,"d":"1.69"}},0.69,{"$f":"(Tabla1[[#This Row],[Producción por ciclo ]]*60*Tabla1[[#This Row],[Eficiencia]])/Tabla1[[#This Row],[Cm]]","v":{"v":283.1087463004034,"d":"283.11"}}]
["D9R",{"v":48784,"d":"48784.00"},"Semi universal",{"v":6.6,"d":"6.600"},{"v":4.31,"d":"4.310"},1.934,0.606,"Concreto ",{"v":2400,"d":"2400.00"},"Empuje dificultoso",{"$f":"IF(Tabla1[[#This Row],[Nivel de empuje]]=\"Empuje facil\",1.1,IF(Tabla1[[#This Row],[Nivel de empuje]]=\"Empuje promedio\",0.9,IF(Tabla1[[#This Row],[Nivel de empuje]]=\"Empuje medio dificultoso\",0.7,IF(Tabla1[[#This Row],[Nivel de empuje]]=\"Empuje dificultoso\",0.6,\" \"))))","v":{"v":0.6,"d":"0.60"}},0.45,{"$f":"Tabla1[[#This Row],[Ancho ]]*(Tabla1[[#This Row],[Altura ]]^2)*Tabla1[[#This Row],[Factor Hoja]]","v":{"v":9.672560615999997,"d":"9.673"}},{"$f":"Tabla1[[#This Row],[Producción por ciclo ]]/(Tabla1[[#This Row],[Profundidad]]*Tabla1[[#This Row],[Ancho ]])","v":{"v":3.703322772277227,"d":"3.70"}},{"$f":"MROUND(3*Tabla1[[#This Row],[Longitud ]],10)","v":{"v":20,"d":"20.00"}},{"$f":"Tabla1[[#This Row],[Producción por ciclo ]]/(Tabla1[[#This Row],[dmin]]*Tabla1[[#This Row],[Ancho ]])","v":{"v":0.11221067999999998,"d":"0.1122"}},{"$f":"IF(Tabla1[[#This Row],[Profundidad]]>Tabla1[[#This Row],[Profundidad de trabajo ]],\"Conforme\",\"No conforme\")","v":"Conforme"},{"$f":"Tabla1[[#This Row],[Densidad ]]*Tabla1[[#This Row],[Producción por ciclo ]]","v":{"v":23214.14547839999,"d":"23214.15"}},{"v":0.1,"d":"0.10"},{"$f":"Tabla1[[#This Row],[Peso ]]+Tabla1[[#This Row],[Peso de material]]","v":{"v":71998.1454784,"d":"71998.15"}},{"$f":"(Tabla1[[#This Row],[Factor de tracción ]]*Tabla1[[#This Row],[Carga total]])/1000","v":{"v":32.39916546528,"d":"32.40"}},2.49,1.41,{"$f":"Tabla1[[#This Row],[dmin]]/(Tabla1[[#This Row],[Velod. Avance]]*1000/60)","v":{"v":0.4819277108433735,"d":"0.48"}},{"$f":"Tabla1[[#This Row],[dmin]]/(Tabla1[[#This Row],[Velod. Retroceso]]*1000/60)","v":{"v":0.851063829787234,"d":"0.85"}},{"$f":"Tabla1[[#This Row],[Power shift]]+Tabla1[[#This Row],[T. Avance]]+Tabla1[[#This Row],[T. Retroceso]]","v":{"v":1.4329915406306075,"d":"1.43"}},0.69,{"$f":"(Tabla1[[#This Row],[Producción por ciclo ]]*60*Tabla1[[#This Row],[Eficiencia]])/Tabla1[[#This Row],[Cm]]","v":{"v":279.4461782559993,"d":"279.45"}}]
["D9R",{"v":48784,"d":"48784.00"},"Semi universal",{"v":6.6,"d":"6.600"},{"v":4.31,"d":"4.310"},1.934,0.606,"Arcilla seca ",{"v":1480,"d":"1480.00"},"Empuje medio dificultoso",{"$f":"IF(Tabla1[[#This Row],[Nivel de empuje]]=\"Empuje facil\",1.1,IF(Tabla1[[#This Row],[Nivel de empuje]]=\"Empuje promedio\",0.9,IF(Tabla1[[#This Row],[Nivel de empuje]]=\"Empuje medio dificultoso\",0.7,IF(Tabla1[[#This Row],[Nivel de empuje]]=\"Empuje dificultoso\",0.6,\" \"))))","v":{"v":0.7,"d":"0.70"}},{"v":0.9,"d":"0.90"},{"$f":"Tabla1[[#This Row],[Ancho ]]*(Tabla1[[#This Row],[Altura ]]^2)*Tabla1[[#This Row],[Factor Hoja]]","v":{"v":11.284654051999997,"d":"11.285"}},{"$f":"Tabla1[[#This Row],[Producción por ciclo ]]/(Tabla1[[#This Row],[Profundidad]]*Tabla1[[#This Row],[Ancho ]])","v":{"v":4.320543234323432,"d":"4.32"}},{"$f":"MROUND(3*Tabla1[[#This Row],[Longitud ]],10)","v":{"v":20,"d":"20.00"}},{"$f":"Tabla1[[#This Row],[Producción por ciclo ]]/(Tabla1[[#This Row],[dmin]]*Tabla1[[#This Row],[Ancho ]])","v":{"v":0.13091245999999998,"d":"0.1309"}},{"$f":"IF(Tabla1[[#This Row],[Profundidad]]>Tabla1[[#This Row],[Profundidad de trabajo ]],\"Conforme\",\"No conforme\")","v":"Conforme"},{"$f":"Tabla1[[#This Row],[Densidad ]]*Tabla1[[#This Row],[Producción por ciclo ]]","v":{"v":16701.287996959996,"d":"16701.29"}},{"v":0.1,"d":"0.10"},{"$f":"Tabla1[[#This Row],[Peso ]]+Tabla1[[#This Row],[Peso de material]]","v":{"v":65485.287996959996,"d":"65485.29"}},{"$f":"(Tabla1[[#This Row],[Factor de tracción ]]*Tabla1[[#This Row],[Carga total]])/1000","v":{"v":58.936759197264,"d":"58.94"}},0.81,1.41,{"$f":"Tabla1[[#This Row],[dmin]]/(Tabla1[[#This Row],[Velod. Avance]]*1000/60)","v":{"v":1.4814814814814814,"d":"1.48"}},{"$f":"Tabla1[[#This Row],[dmin]]/(Tabla1[[#This Row],[Velod. Retroceso]]*1000/60)","v":{"v":0.851063829787234,"d":"0.85"}},{"$f":"Tabla1[[#This Row],[Power shift]]+Tabla1[[#This Row],[T. Avance]]+Tabla1[[#This Row],[T. Retroceso]]","v":{"v":2.4325453112687154,"d":"2.43"}},0.69,{"$f":"(Tabla1[[#This Row],[Producción por ciclo ]]*60*Tabla1[[#This Row],[Eficiencia]])/Tabla1[[#This Row],[Cm]]","v":{"v":192.05589946817292,"d":"192.06"}}]
["D9R",{"v":48784,"d":"48784.00"},"Semi universal",{"v":6.6,"d":"6.600"},{"v":4.31,"d":"4.310"},1.934,0.606,"Arcilla húmeda",{"v":1660,"d":"1660.00"},"Empuje facil",{"$f":"IF(Tabla1[[#This Row],[Nivel de empuje]]=\"Empuje facil\",1.1,IF(Tabla1[[#This Row],[Nivel de empuje]]=\"Empuje promedio\",0.9,IF(Tabla1[[#This Row],[Nivel de empuje]]=\"Empuje medio dificultoso\",0.7,IF(Tabla1[[#This Row],[Nivel de empuje]]=\"Empuje dificultoso\",0.6,\" \"))))","v":{"v":1.1,"d":"1.10"}},{"v":0.7,"d":"0.70"},{"$f":"Tabla1[[#This Row],[Ancho ]]*(Tabla1[[#This Row],[Altura ]]^2)*Tabla1[[#This Row],[Factor Hoja]]","v":{"v":17.733027796,"d":"17.733"}},{"$f":"Tabla1[[#This Row],[Producción por ciclo ]]/(Tabla1[[#This Row],[Profundidad]]*Tabla1[[#This Row],[Ancho ]])","v":{"v":6.789425082508251,"d":"6.79"}},{"$f":"MROUND(3*Tabla1[[#This Row],[Longitud ]],10)","v":{"v":20,"d":"20.00"}},{"$f":"Tabla1[[#This Row],[Producción por ciclo ]]/(Tabla1[[#This Row],[dmin]]*Tabla1[[#This Row],[Ancho ]])","v":{"v":0.20571958,"d":"0.2057"}},{"$f":"IF(Tabla1[[#This Row],[Profundidad]]>Tabla1[[#This Row],[Profundidad de trabajo ]],\"Conforme\",\"No conforme\")","v":"Conforme"},{"$f":"Tabla1[[#This Row],[Densidad ]]*Tabla1[[#This Row],[Producción por ciclo ]]","v":{"v":29436.826141359998,"d":"29436.83"}},{"v":0.1,"d":"0.10"},{"$f":"Tabla1[[#This Row],[Peso ]]+Tabla1[[#This Row],[Peso de material]]","v":{"v":78220.82614136,"d":"78220.83"}},{"$f":"(Tabla1[[#This Row],[Factor de tracción ]]*Tabla1[[#This Row],[Carga total]])/1000","v":{"v":54.75457829895199,"d":"54.75"}},1.14,1.41,{"$f":"Tabla1[[#This Row],[dmin]]/(Tabla1[[#This Row],[Velod. Avance]]*1000/60)","v":{"v":1.0526315789473684,"d":"1.05"}},{"$f":"Tabla1[[#This Row],[dmin]]/(Tabla1[[#This Row],[Velod. Retroceso]]*1000/60)","v":{"v":0.851063829787234,"d":"0.85"}},{"$f":"Tabla1[[#This Row],[Power shift]]+Tabla1[[#This Row],[T. Avance]]+Tabla1[[#This Row],[T. Retroceso]]","v":{"v":2.0036954087346026,"d":"2.00"}},0.69,{"$f":"(Tabla1[[#This Row],[Producción por ciclo ]]*60*Tabla1[[#This Row],[Eficiencia]])/Tabla1[[#This Row],[Cm]]","v":{"v":366.3966826265462,"d":"366.40"}}]
["D9R",{"v":48784,"d":"48784.00"},"Semi universal",{"v":6.6,"d":"6.600"},{"v":4.31,"d":"4.310"},1.934,0.606,"Arena seca ",{"v":1420,"d":"1420.00"},"Empuje facil",{"$f":"IF(Tabla1[[#This Row],[Nivel de empuje]]=\"Empuje facil\",1.1,IF(Tabla1[[#This Row],[Nivel de empuje]]=\"Empuje promedio\",0.9,IF(Tabla1[[#This Row],[Nivel de empuje]]=\"Empuje medio dificultoso\",0.7,IF(Tabla1[[#This Row],[Nivel de empuje]]=\"Empuje dificultoso\",0.6,\" \"))))","v":{"v":1.1,"d":"1.10"}},0.39,{"$f":"Tabla1[[#This Row],[Ancho ]]*(Tabla1[[#This Row],[Altura ]]^2)*Tabla1[[#This Row],[Factor Hoja]]","v":{"v":17.733027796,"d":"17.733"}},{"$f":"Tabla1[[#This Row],[Producción por ciclo ]]/(Tabla1[[#This Row],[Profundidad]]*Tabla1[[#This Row],[Ancho ]])","v":{"v":6.789425082508251,"d":"6.79"}},{"$f":"MROUND(3*Tabla1[[#This Row],[Longitud ]],10)","v":{"v":20,"d":"20.00"}},{"$f":"Tabla1[[#This Row],[Producción por ciclo ]]/(Tabla1[[#This Row],[dmin]]*Tabla1[[#This Row],[Ancho ]])","v":{"v":0.20571958,"d":"0.2057"}},{"$f":"IF(Tabla1[[#This Row],[Profundidad]]>Tabla1[[#This Row],[Profundidad de trabajo ]],\"Conforme\",\"No conforme\")","v":"Conforme"},{"$f":"Tabla1[[#This Row],[Densidad ]]*Tabla1[[#This Row],[Producción por ciclo ]]","v":{"v":25180.899470319997,"d":"25180.90"}},{"v":0.1,"d":"0.10"},{"$f":"Tabla1[[#This Row],[Peso ]]+Tabla1[[#This Row],[Peso de material]]","v":{"v":73964.89947032,"d":"73964.90"}},{"$f":"(Tabla1[[#This Row],[Factor de tracción ]]*Tabla1[[#This Row],[Carga total]])/1000","v":{"v":28.8463107934248,"d":"28.85"}},2.71,1.41,{"$f":"Tabla1[[#This Row],[dmin]]/(Tabla1[[#This Row],[Velod. Avance]]*1000/60)","v":{"v":0.44280442804428044,"d":"0.44"}},{"$f":"Tabla1[[#This Row],[dmin]]/(Tabla1[[#This Row],[Velod. Retroceso]]*1000/60)","v":{"v":0.851063829787234,"d":"0.85"}},{"$f":"Tabla1[[#This Row],[Power shift]]+Tabla1[[#This Row],[T. Avance]]+Tabla1[[#This Row],[T. Retroceso]]","v":{"v":1.3938682578315145,"d":"1.39"}},0.69,{"$f":"(Tabla1[[#This Row],[Producción por ciclo ]]*60*Tabla1[[#This Row],[Eficiencia]])/Tabla1[[#This Row],[Cm]]","v":{"v":526.6978042075056,"d":"526.70"}}]
["D9R",{"v":48784,"d":"48784.00"},"Semi universal",{"v":6.6,"d":"6.600"},{"v":4.31,"d":"4.310"},1.934,0.606,"Arena húmeda ",{"v":1690,"d":"1690.00"},"Empuje medio dificultoso",{"$f":"IF(Tabla1[[#This Row],[Nivel de empuje]]=\"Empuje facil\",1.1,IF(Tabla1[[#This Row],[Nivel de empuje]]=\"Empuje promedio\",0.9,IF(Tabla1[[#This Row],[Nivel de empuje]]=\"Empuje medio dificultoso\",0.7,IF(Tabla1[[#This Row],[Nivel de empuje]]=\"Empuje dificultoso\",0.6,\" \"))))","v":{"v":0.7,"d":"0.70"}},{"v":0.5,"d":"0.50"},{"$f":"Tabla1[[#This Row],[Ancho ]]*(Tabla1[[#This Row],[Altura ]]^2)*Tabla1[[#This Row],[Factor Hoja]]","v":{"v":11.284654051999997,"d":"11.285"}},{"$f":"Tabla1[[#This Row],[Producción por ciclo ]]/(Tabla1[[#This Row],[Profundidad]]*Tabla1[[#This Row],[Ancho ]])","v":{"v":4.320543234323432,"d":"4.32"}},{"$f":"MROUND(3*Tabla1[[#This Row],[Longitud ]],10)","v":{"v":20,"d":"20.00"}},{"$f":"Tabla1[[#This Row],[Producción por ciclo ]]/(Tabla1[[#This Row],[dmin]]*Tabla1[[#This Row],[Ancho ]])","v":{"v":0.13091245999999998,"d":"0.1309"}},{"$f":"IF(Tabla1[[#This Row],[Profundidad]]>Tabla1[[#This Row],[Profundidad de trabajo ]],\"Conforme\",\"No conforme\")","v":"Conforme"},{"$f":"Tabla1[[#This Row],[Densidad ]]*Tabla1[[#This Row],[Producción por ciclo ]]","v":{"v":19071.065347879994,"d":"19071.07"}},{"v":0.1,"d":"0.10"},{"$f":"Tabla1[[#This Row],[Peso ]]+Tabla1[[#This Row],[Peso de material]]","v":{"v":67855.06534788,"d":"67855.07"}},{"$f":"(Tabla1[[#This Row],[Factor de tracción ]]*Tabla1[[#This Row],[Carga total]])/1000","v":{"v":33.92753267394,"d":"33.93"}},2.35,1.41,{"$f":"Tabla1[[#This Row],[dmin]]/(Tabla1[[#This Row],[Velod. Avance]]*1000/60)","v":{"v":0.5106382978723405,"d":"0.51"}},{"$f":"Tabla1[[#This Row],[dmin]]/(Tabla1[[#This Row],[Velod. Retroceso]]*1000/60)","v":{"v":0.851063829787234,"d":"0.85"}},{"$f":"Tabla1[[#This Row],[Power shift]]+Tabla1[[#This Row],[T. Avance]]+Tabla1[[#This Row],[T. Retroceso]]","v":{"v":1.4617021276595745,"d":"1.46"}},0.69,{"$f":"(Tabla1[[#This Row],[Producción por ciclo ]]*60*Tabla1[[#This Row],[Eficiencia]])/Tabla1[[#This Row],[Cm]]","v":{"v":319.6168828876505,"d":"319.62"}}]
["D9R",{"v":48784,"d":"48784.00"},"Semi universal",{"v":6.6,"d":"6.600"},{"v":4.31,"d":"4.310"},1.934,0.606,"Grava suelta ",{"v":1930,"d":"1930.00"},"Empuje promedio",{"$f":"IF(Tabla1[[#This Row],[Nivel de empuje]]=\"Empuje facil\",1.1,IF(Tabla1[[#This Row],[Nivel de empuje]]=\"Empuje promedio\",0.9,IF(Tabla1[[#This Row],[Nivel de empuje]]=\"Empuje medio dificultoso\",0.7,IF(Tabla1[[#This Row],[Nivel de empuje]]=\"Empuje dificultoso\",0.6,\" \"))))","v":{"v":0.9,"d":"0.90"}},{"v":0.5,"d":"0.50"},{"$f":"Tabla1[[#This Row],[Ancho ]]*(Tabla1[[#This Row],[Altura ]]^2)*Tabla1[[#This Row],[Factor Hoja]]","v":{"v":14.508840923999998,"d":"14.509"}},{"$f":"Tabla1[[#This Row],[Producción por ciclo ]]/(Tabla1[[#This Row],[Profundidad]]*Tabla1[[#This Row],[Ancho ]])","v":{"v":5.5549841584158415,"d":"5.55"}},{"$f":"MROUND(3*Tabla1[[#This Row],[Longitud ]],10)","v":{"v":20,"d":"20.00"}},{"$f":"Tabla1[[#This Row],[Producción por ciclo ]]/(Tabla1[[#This Row],[dmin]]*Tabla1[[#This Row],[Ancho ]])","v":{"v":0.16831601999999998,"d":"0.1683"}},{"$f":"IF(Tabla1[[#This Row],[Profundidad]]>Tabla1[[#This Row],[Profundidad de trabajo ]],\"Conforme\",\"No conforme\")","v":"Conforme"},{"$f":"Tabla1[[#This Row],[Densidad ]]*Tabla1[[#This Row],[Producción por ciclo ]]","v":{"v":28002.062983319996,"d":"28002.06"}},{"v":0.1,"d":"0.10"},{"$f":"Tabla1[[#This Row],[Peso ]]+Tabla1[[#This Row],[Peso de material]]","v":{"v":76786.06298332,"d":"76786.06"}},{"$f":"(Tabla1[[#This Row],[Factor de tracción ]]*Tabla1[[#This Row],[Carga total]])/1000","v":{"v":38.39303149166,"d":"38.39"}},2.09,1.41,{"$f":"Tabla1[[#This Row],[dmin]]/(Tabla1[[#This Row],[Velod. Avance]]*1000/60)","v":{"v":0.5741626794258373,"d":"0.57"}},{"$f":"Tabla1[[#This Row],[dmin]]/(Tabla1[[#This Row],[Velod. Retroceso]]*1000/60)","v":{"v":0.851063829787234,"d":"0.85"}},{"$f":"Tabla1[[#This Row],[Power shift]]+Tabla1[[#This Row],[T. Avance]]+Tabla1[[#This Row],[T. Retroceso]]","v":{"v":1.5252265092130712,"d":"1.53"}},0.69,{"$f":"(Tabla1[[#This Row],[Producción por ciclo ]]*60*Tabla1[[#This Row],[Eficiencia]])/Tabla1[[#This Row],[Cm]]","v":{"v":393.8208591480021,"d":"393.82"}}]
["D9R",{"v":48784,"d":"48784.00"},"Semi universal",{"v":6.6,"d":"6.600"},{"v":4.31,"d":"4.310"},1.934,0.606,"Nieve compacta",{"v":130,"d":"130.00"},"Empuje medio dificultoso",{"$f":"IF(Tabla1[[#This Row],[Nivel de empuje]]=\"Empuje facil\",1.1,IF(Tabla1[[#This Row],[Nivel de empuje]]=\"Empuje promedio\",0.9,IF(Tabla1[[#This Row],[Nivel de empuje]]=\"Empuje medio dificultoso\",0.7,IF(Tabla1[[#This Row],[Nivel de empuje]]=\"Empuje dificultoso\",0.6,\" \"))))","v":{"v":0.7,"d":"0.70"}},0.27,{"$f":"Tabla1[[#This Row],[Ancho ]]*(Tabla1[[#This Row],[Altura ]]^2)*Tabla1[[#This Row],[Factor Hoja]]","v":{"v":11.284654051999997,"d":"11.285"}},{"$f":"Tabla1[[#This Row],[Producción por ciclo ]]/(Tabla1[[#This Row],[Profundidad]]*Tabla1[[#This Row],[Ancho ]])","v":{"v":4.320543234323432,"d":"4.32"}},{"$f":"MROUND(3*Tabla1[[#This Row],[Longitud ]],10)","v":{"v":20,"d":"20.00"}},{"$f":"Tabla1[[#This Row],[Producción por ciclo ]]/(Tabla1[[#This Row],[dmin]]*Tabla1[[#This Row],[Ancho ]])","v":{"v":0.13091245999999998,"d":"0.1309"}},{"$f":"IF(Tabla1[[#This Row],[Profundidad]]>Tabla1[[#This Row],[Profundidad de trabajo ]],\"Conforme\",\"No conforme\")","v":"Conforme"},{"$f":"Tabla1[[#This Row],[Densidad ]]*Tabla1[[#This Row],[Producción por ciclo ]]","v":{"v":1467.0050267599995,"d":"1467.01"}},{"v":0.1,"d":"0.10"},{"$f":"Tabla1[[#This Row],[Peso ]]+Tabla1[[#This Row],[Peso de material]]","v":{"v":50251.00502676,"d":"50251.01"}},{"$f":"(Tabla1[[#This Row],[Factor de tracción ]]*Tabla1[[#This Row],[Carga total]])/1000","v":{"v":13.567771357225201,"d":"13.57"}},5.29,1.41,{"$f":"Tabla1[[#This Row],[dmin]]/(Tabla1[[#This Row],[Velod. Avance]]*1000/60)","v":{"v":0.22684310018903592,"d":"0.23"}},{"$f":"Tabla1[[#This Row],[dmin]]/(Tabla1[[#This Row],[Velod. Retroceso]]*1000/60)","v":{"v":0.851063829787234,"d":"0.85"}},{"$f":"Tabla1[[#This Row],[Power shift]]+Tabla1[[#This Row],[T. Avance]]+Tabla1[[#This Row],[T. Retroceso]]","v":{"v":1.17790692997627,"d":"1.18"}},0.69,{"$f":"(Tabla1[[#This Row],[Producción por ciclo ]]*60*Tabla1[[#This Row],[Eficiencia]])/Tabla1[[#This Row],[Cm]]","v":{"v":396.6227431586736,"d":"396.62"}}]
["D9R",{"v":48784,"d":"48784.00"},"Semi universal",{"v":6.6,"d":"6.600"},{"v":4.31,"d":"4.310"},1.934,0.606,"Hielo ",{"v":520,"d":"520.00"},"Empuje dificultoso",{"$f":"IF(Tabla1[[#This Row],[Nivel de empuje]]=\"Empuje facil\",1.1,IF(Tabla1[[#This Row],[Nivel de empuje]]=\"Empuje promedio\",0.9,IF(Tabla1[[#This Row],[Nivel de empuje]]=\"Empuje medio dificultoso\",0.7,IF(Tabla1[[#This Row],[Nivel de empuje]]=\"Empuje dificultoso\",0.6,\" \"))))","v":{"v":0.6,"d":"0.60"}},0.12,{"$f":"Tabla1[[#This Row],[Ancho ]]*(Tabla1[[#This Row],[Altura ]]^2)*Tabla1[[#This Row],[Factor Hoja]]","v":{"v":9.672560615999997,"d":"9.673"}},{"$f":"Tabla1[[#This Row],[Producción por ciclo ]]/(Tabla1[[#This Row],[Profundidad]]*Tabla1[[#This Row],[Ancho ]])","v":{"v":3.703322772277227,"d":"3.70"}},{"$f":"MROUND(3*Tabla1[[#This Row],[Longitud ]],10)","v":{"v":20,"d":"20.00"}},{"$f":"Tabla1[[#This Row],[Producción por ciclo ]]/(Tabla1[[#This Row],[dmin]]*Tabla1[[#This Row],[Ancho ]])","v":{"v":0.11221067999999998,"d":"0.1122"}},{"$f":"IF(Tabla1[[#This Row],[Profundidad]]>Tabla1[[#This Row],[Profundidad de trabajo ]],\"Conforme\",\"No conforme\")","v":"Conforme"},{"$f":"Tabla1[[#This Row],[Densidad ]]*Tabla1[[#This Row],[Producción por ciclo ]]","v":{"v":5029.731520319998,"d":"5029.73"}},{"$f":"2*0.05","v":{"v":0.1,"d":"0.10"}},{"$f":"Tabla1[[#This Row],[Peso ]]+Tabla1[[#This Row],[Peso de material]]","v":{"v":53813.73152032,"d":"53813.73"}},{"$f":"(Tabla1[[#This Row],[Factor de tracción ]]*Tabla1[[#This Row],[Carga total]])/1000","v":{"v":6.457647782438399,"d":"6.46"}},10.21,1.41,{"$f":"Tabla1[[#This Row],[dmin]]/(Tabla1[[#This Row],[Velod. Avance]]*1000/60)","v":{"v":0.11753183153770813,"d":"0.12"}},{"$f":"Tabla1[[#This Row],[dmin]]/(Tabla1[[#This Row],[Velod. Retroceso]]*1000/60)","v":{"v":0.851063829787234,"d":"0.85"}},{"$f":"Tabla1[[#This Row],[Power shift]]+Tabla1[[#This Row],[T. Avance]]+Tabla1[[#This Row],[T. Retroceso]]","v":{"v":1.068595661324942,"d":"1.07"}},0.69,{"$f":"(Tabla1[[#This Row],[Producción por ciclo ]]*60*Tabla1[[#This Row],[Eficiencia]])/Tabla1[[#This Row],[Cm]]","v":{"v":374.7385695033544,"d":"374.74"}}]
["D9R",{"v":48784,"d":"48784.00"},"Semi universal",{"v":6.6,"d":"6.600"},{"v":4.31,"d":"4.310"},1.934,0.606,"Tierra firme ",{"v":1510,"d":"1510.00"},"Empuje facil",{"$f":"IF(Tabla1[[#This Row],[Nivel de empuje]]=\"Empuje facil\",1.1,IF(Tabla1[[#This Row],[Nivel de empuje]]=\"Empuje promedio\",0.9,IF(Tabla1[[#This Row],[Nivel de empuje]]=\"Empuje medio dificultoso\",0.7,IF(Tabla1[[#This Row],[Nivel de empuje]]=\"Empuje dificultoso\",0.6,\" \"))))","v":{"v":1.1,"d":"1.10"}},{"v":0.9,"d":"0.90"},{"$f":"Tabla1[[#This Row],[Ancho ]]*(Tabla1[[#This Row],[Altura ]]^2)*Tabla1[[#This Row],[Factor Hoja]]","v":{"v":17.733027796,"d":"17.733"}},{"$f":"Tabla1[[#This Row],[Producción por ciclo ]]/(Tabla1[[#This Row],[Profundidad]]*Tabla1[[#This Row],[Ancho ]])","v":{"v":6.789425082508251,"d":"6.79"}},{"$f":"MROUND(3*Tabla1[[#This Row],[Longitud ]],10)","v":{"v":20,"d":"20.00"}},{"$f":"Tabla1[[#This Row],[Producción por ciclo ]]/(Tabla1[[#This Row],[dmin]]*Tabla1[[#This Row],[Ancho ]])","v":{"v":0.20571958,"d":"0.2057"}},{"$f":"IF(Tabla1[[#This Row],[Profundidad]]>Tabla1[[#This Row],[Profundidad de trabajo ]],\"Conforme\",\"No conforme\")","v":"Conforme"},{"$f":"Tabla1[[#This Row],[Densidad ]]*Tabla1[[#This Row],[Producción por ciclo ]]","v":{"v":26776.871971959998,"d":"26776.87"}},{"v":0.1,"d":"0.10"},{"$f":"Tabla1[[#This Row],[Peso ]]+Tabla1[[#This Row],[Peso de material]]","v":{"v":75560.87197196,"d":"75560.87"}},{"$f":"(Tabla1[[#This Row],[Factor de tracción ]]*Tabla1[[#This Row],[Carga total]])/1000","v":{"v":68.004784774764,"d":"68.00"}},0.49,1.41,{"$f":"Tabla1[[#This Row],[dmin]]/(Tabla1[[#This Row],[Velod. Avance]]*1000/60)","v":{"v":2.4489795918367347,"d":"2.45"}},{"$f":"Tabla1[[#This Row],[dmin]]/(Tabla1[[#This Row],[Velod. Retroceso]]*1000/60)","v":{"v":0.851063829787234,"d":"0.85"}},{"$f":"Tabla1[[#This Row],[Power shift]]+Tabla1[[#This Row],[T. Avance]]+Tabla1[[#This Row],[T. Retroceso]]","v":{"v":3.4000434216239688,"d":"3.40"}},0.69,{"$f":"(Tabla1[[#This Row],[Producción por ciclo ]]*60*Tabla1[[#This Row],[Eficiencia]])/Tabla1[[#This Row],[Cm]]","v":{"v":215.9229338323414,"d":"215.92"}}]
["D9R",{"v":48784,"d":"48784.00"},"Semi universal",{"v":6.6,"d":"6.600"},{"v":4.31,"d":"4.310"},1.934,0.606,"Tierra suelta ",{"v":1250,"d":"1250.00"},"Empuje facil",{"$f":"IF(Tabla1[[#This Row],[Nivel de empuje]]=\"Empuje facil\",1.1,IF(Tabla1[[#This Row],[Nivel de empuje]]=\"Empuje promedio\",0.9,IF(Tabla1[[#This Row],[Nivel de empuje]]=\"Empuje medio dificultoso\",0.7,IF(Tabla1[[#This Row],[Nivel de empuje]]=\"Empuje dificultoso\",0.6,\" \"))))","v":{"v":1.1,"d":"1.10"}},{"v":0.6,"d":"0.60"},{"$f":"Tabla1[[#This Row],[Ancho ]]*(Tabla1[[#This Row],[Altura ]]^2)*Tabla1[[#This Row],[Factor Hoja]]","v":{"v":17.733027796,"d":"17.733"}},{"$f":"Tabla1[[#This Row],[Producción por ciclo ]]/(Tabla1[[#This Row],[Profundidad]]*Tabla1[[#This Row],[Ancho ]])","v":{"v":6.789425082508251,"d":"6.79"}},{"$f":"MROUND(3*Tabla1[[#This Row],[Longitud ]],10)","v":{"v":20,"d":"20.00"}},{"$f":"Tabla1[[#This Row],[Producción por ciclo ]]/(Tabla1[[#This Row],[dmin]]*Tabla1[[#This Row],[Ancho ]])","v":{"v":0.20571958,"d":"0.2057"}},{"$f":"IF(Tabla1[[#This Row],[Profundidad]]>Tabla1[[#This Row],[Profundidad de trabajo ]],\"Conforme\",\"No conforme\")","v":"Conforme"},{"$f":"Tabla1[[#This Row],[Densidad ]]*Tabla1[[#This Row],[Producción por ciclo ]]","v":{"v":22166.284744999997,"d":"22166.28"}},{"v":0.1,"d":"0.10"},{"$f":"Tabla1[[#This Row],[Peso ]]+Tabla1[[#This Row],[Peso de material]]","v":{"v":70950.284745,"d":"70950.28"}},{"$f":"(Tabla1[[#This Row],[Factor de tracción ]]*Tabla1[[#This Row],[Carga total]])/1000","v":{"v":42.57017084699999,"d":"42.57"}},1.79,1.41,{"$f":"Tabla1[[#This Row],[dmin]]/(Tabla1[[#This Row],[Velod. Avance]]*1000/60)","v":{"v":0.670391061452514,"d":"0.67"}},{"$f":"Tabla1[[#This Row],[dmin]]/(Tabla1[[#This Row],[Velod. Retroceso]]*1000/60)","v":{"v":0.851063829787234,"d":"0.85"}},{"$f":"Tabla1[[#This Row],[Power shift]]+Tabla1[[#This Row],[T. Avance]]+Tabla1[[#This Row],[T. Retroceso]]","v":{"v":1.6214548912397482,"d":"1.62"}},0.69,{"$f":"(Tabla1[[#This Row],[Producción por ciclo ]]*60*Tabla1[[#This Row],[Eficiencia]])/Tabla1[[#This Row],[Cm]]","v":{"v":452.7707521934688,"d":"452.77"}}]
["D9R",{"v":48784,"d":"48784.00"},"Semi universal",{"v":6.6,"d":"6.600"},{"v":4.31,"d":"4.310"},1.934,0.606,"Carbón ",{"v":1190,"d":"1190.00"},"Empuje promedio",{"$f":"IF(Tabla1[[#This Row],[Nivel de empuje]]=\"Empuje facil\",1.1,IF(Tabla1[[#This Row],[Nivel de empuje]]=\"Empuje promedio\",0.9,IF(Tabla1[[#This Row],[Nivel de empuje]]=\"Empuje medio dificultoso\",0.7,IF(Tabla1[[#This Row],[Nivel de empuje]]=\"Empuje dificultoso\",0.6,\" \"))))","v":{"v":0.9,"d":"0.90"}},{"v":0.6,"d":"0.60"},{"$f":"Tabla1[[#This Row],[Ancho ]]*(Tabla1[[#This Row],[Altura ]]^2)*Tabla1[[#This Row],[Factor Hoja]]","v":{"v":14.508840923999998,"d":"14.509"}},{"$f":"Tabla1[[#This Row],[Producción por ciclo ]]/(Tabla1[[#This Row],[Profundidad]]*Tabla1[[#This Row],[Ancho ]])","v":{"v":5.5549841584158415,"d":"5.55"}},{"$f":"MROUND(3*Tabla1[[#This Row],[Longitud ]],10)","v":{"v":20,"d":"20.00"}},{"$f":"Tabla1[[#This Row],[Producción por ciclo ]]/(Tabla1[[#This Row],[dmin]]*Tabla1[[#This Row],[Ancho ]])","v":{"v":0.16831601999999998,"d":"0.1683"}},{"$f":"IF(Tabla1[[#This Row],[Profundidad]]>Tabla1[[#This Row],[Profundidad de trabajo ]],\"Conforme\",\"No conforme\")","v":"Conforme"},{"$f":"Tabla1[[#This Row],[Densidad ]]*Tabla1[[#This Row],[Producción por ciclo ]]","v":{"v":17265.52069956,"d":"17265.52"}},{"v":0.1,"d":"0.10"},{"$f":"Tabla1[[#This Row],[Peso ]]+Tabla1[[#This Row],[Peso de material]]","v":{"v":66049.52069956,"d":"66049.52"}},{"$f":"(Tabla1[[#This Row],[Factor de tracción ]]*Tabla1[[#This Row],[Carga total]])/1000","v":{"v":39.629712419736,"d":"39.63"}},2.01,1.41,{"$f":"Tabla1[[#This Row],[dmin]]/(Tabla1[[#This Row],[Velod. Avance]]*1000/60)","v":{"v":0.5970149253731345,"d":"0.60"}},{"$f":"Tabla1[[#This Row],[dmin]]/(Tabla1[[#This Row],[Velod. Retroceso]]*1000/60)","v":{"v":0.851063829787234,"d":"0.85"}},{"$f":"Tabla1[[#This Row],[Power shift]]+Tabla1[[#This Row],[T. Avance]]+Tabla1[[#This Row],[T. Retroceso]]","v":{"v":1.5480787551603685,"d":"1.55"}},0.69,{"$f":"(Tabla1[[#This Row],[Producción por ciclo ]]*60*Tabla1[[#This Row],[Eficiencia]])/Tabla1[[#This Row],[Cm]]","v":{"v":388.00740094865245,"d":"388.01"}}]
["D9R",{"v":48784,"d":"48784.00"},"Universal ",{"v":6.96,"d":"6.960"},{"v":4.65,"d":"4.650"},1.934,0.606,"Concreto ",{"v":2400,"d":"2400.00"},"Empuje dificultoso",{"$f":"IF(Tabla1[[#This Row],[Nivel de empuje]]=\"Empuje facil\",1.1,IF(Tabla1[[#This Row],[Nivel de empuje]]=\"Empuje promedio\",0.9,IF(Tabla1[[#This Row],[Nivel de empuje]]=\"Empuje medio dificultoso\",0.7,IF(Tabla1[[#This Row],[Nivel de empuje]]=\"Empuje dificultoso\",0.6,\" \"))))","v":{"v":0.6,"d":"0.60"}},0.45,{"$f":"Tabla1[[#This Row],[Ancho ]]*(Tabla1[[#This Row],[Altura ]]^2)*Tabla1[[#This Row],[Factor Hoja]]","v":{"v":10.43559324,"d":"10.436"}},{"$f":"Tabla1[[#This Row],[Producción por ciclo ]]/(Tabla1[[#This Row],[Profundidad]]*Tabla1[[#This Row],[Ancho ]])","v":{"v":3.703322772277227,"d":"3.70"}},{"$f":"MROUND(3*Tabla1[[#This Row],[Longitud ]],10)","v":{"v":20,"d":"20.00"}},{"$f":"Tabla1[[#This Row],[Producción por ciclo ]]/(Tabla1[[#This Row],[dmin]]*Tabla1[[#This Row],[Ancho ]])","v":{"v":0.11221068,"d":"0.1122"}},{"$f":"IF(Tabla1[[#This Row],[Profundidad]]>Tabla1[[#This Row],[Profundidad de trabajo ]],\"Conforme\",\"No conforme\")","v":"Conforme"},{"$f":"Tabla1[[#This Row],[Densidad ]]*Tabla1[[#This Row],[Producción por ciclo ]]","v":{"v":25045.423776,"d":"25045.42"}},{"v":0.1,"d":"0.10"},{"$f":"Tabla1[[#This Row],[Peso ]]+Tabla1[[#This Row],[Peso de material]]","v":{"v":73829.423776,"d":"73829.42"}},{"$f":"(Tabla1[[#This Row],[Factor de tracción ]]*Tabla1[[#This Row],[Carga total]])/1000","v":{"v":33.2232406992,"d":"33.22"}},2.35,1.41,{"$f":"Tabla1[[#This Row],[dmin]]/(Tabla1[[#This Row],[Velod. Avance]]*1000/60)","v":{"v":0.5106382978723405,"d":"0.51"}},{"$f":"Tabla1[[#This Row],[dmin]]/(Tabla1[[#This Row],[Velod. Retroceso]]*1000/60)","v":{"v":0.851063829787234,"d":"0.85"}},{"$f":"Tabla1[[#This Row],[Power shift]]+Tabla1[[#This Row],[T. Avance]]+Tabla1[[#This Row],[T. Retroceso]]","v":{"v":1.4617021276595745,"d":"1.46"}},0.69,{"$f":"(Tabla1[[#This Row],[Producción por ciclo ]]*60*Tabla1[[#This Row],[Eficiencia]])/Tabla1[[#This Row],[Cm]]","v":{"v":295.5688111556331,"d":"295.57"}}]
["D9R",{"v":48784,"d":"48784.00"},"Universal ",{"v":6.96,"d":"6.960"},{"v":4.65,"d":"4.650"},1.934,0.606,"Arcilla seca ",{"v":1480,"d":"1480.00"},"Empuje medio dificultoso",{"$f":"IF(Tabla1[[#This Row],[Nivel de empuje]]=\"Empuje facil\",1.1,IF(Tabla1[[#This Row],[Nivel de empuje]]=\"Empuje promedio\",0.9,IF(Tabla1[[#This Row],[Nivel de empuje]]=\"Empuje medio dificultoso\",0.7,IF(Tabla1[[#This Row],[Nivel de empuje]]=\"Empuje dificultoso\",0.6,\" \"))))","v":{"v":0.7,"d":"0.70"}},{"v":0.9,"d":"0.90"},{"$f":"Tabla1[[#This Row],[Ancho ]]*(Tabla1[[#This Row],[Altura ]]^2)*Tabla1[[#This Row],[Factor Hoja]]","v":{"v":12.17485878,"d":"12.175"}},{"$f":"Tabla1[[#This Row],[Producción por ciclo ]]/(Tabla1[[#This Row],[Profundidad]]*Tabla1[[#This Row],[Ancho ]])","v":{"v":4.320543234323432,"d":"4.32"}},{"$f":"MROUND(3*Tabla1[[#This Row],[Longitud ]],10)","v":{"v":20,"d":"20.00"}},{"$f":"Tabla1[[#This Row],[Producción por ciclo ]]/(Tabla1[[#This Row],[dmin]]*Tabla1[[#This Row],[Ancho ]])","v":{"v":0.13091245999999998,"d":"0.1309"}},{"$f":"IF(Tabla1[[#This Row],[Profundidad]]>Tabla1[[#This Row],[Profundidad de trabajo ]],\"Conforme\",\"No conforme\")","v":"Conforme"},{"$f":"Tabla1[[#This Row],[Densidad ]]*Tabla1[[#This Row],[Producción por ciclo ]]","v":{"v":18018.7909944,"d":"18018.79"}},{"v":0.1,"d":"0.10"},{"$f":"Tabla1[[#This Row],[Peso ]]+Tabla1[[#This Row],[Peso de material]]","v":{"v":66802.7909944,"d":"66802.79"}},{"$f":"(Tabla1[[#This Row],[Factor de tracción ]]*Tabla1[[#This Row],[Carga total]])/1000","v":{"v":60.12251189496,"d":"60.12"}},0.81,1.41,{"$f":"Tabla1[[#This Row],[dmin]]/(Tabla1[[#This Row],[Velod. Avance]]*1000/60)","v":{"v":1.4814814814814814,"d":"1.48"}},{"$f":"Tabla1[[#This Row],[dmin]]/(Tabla1[[#This Row],[Velod. Retroceso]]*1000/60)","v":{"v":0.851063829787234,"d":"0.85"}},{"$f":"Tabla1[[#This Row],[Power shift]]+Tabla1[[#This Row],[T. Avance]]+Tabla1[[#This Row],[T. Retroceso]]","v":{"v":2.4325453112687154,"d":"2.43"}},0.69,{"$f":"(Tabla1[[#This Row],[Producción por ciclo ]]*60*Tabla1[[#This Row],[Eficiencia]])/Tabla1[[#This Row],[Cm]]","v":{"v":207.2064808647342,"d":"207.21"}}]
["D9R",{"v":48784,"d":"48784.00"},"Universal ",{"v":6.96,"d":"6.960"},{"v":4.65,"d":"4.650"},1.934,0.606,"Arcilla húmeda",{"v":1660,"d":"1660.00"},"Empuje facil",{"$f":"IF(Tabla1[[#This Row],[Nivel de empuje]]=\"Empuje facil\",1.1,IF(Tabla1[[#This Row],[Nivel de empuje]]=\"Empuje promedio\",0.9,IF(Tabla1[[#This Row],[Nivel de empuje]]=\"Empuje medio dificultoso\",0.7,IF(Tabla1[[#This Row],[Nivel de empuje]]=\"Empuje dificultoso\",0.6,\" \"))))","v":{"v":1.1,"d":"1.10"}},{"v":0.7,"d":"0.70"},{"$f":"Tabla1[[#This Row],[Ancho ]]*(Tabla1[[#This Row],[Altura ]]^2)*Tabla1[[#This Row],[Factor Hoja]]","v":{"v":19.13192094,"d":"19.132"}},{"$f":"Tabla1[[#This Row],[Producción por ciclo ]]/(Tabla1[[#This Row],[Profundidad]]*Tabla1[[#This Row],[Ancho ]])","v":{"v":6.7894250825082505,"d":"6.79"}},{"$f":"MROUND(3*Tabla1[[#This Row],[Longitud ]],10)","v":{"v":20,"d":"20.00"}},{"$f":"Tabla1[[#This Row],[Producción por ciclo ]]/(Tabla1[[#This Row],[dmin]]*Tabla1[[#This Row],[Ancho ]])","v":{"v":0.20571958,"d":"0.2057"}},{"$f":"IF(Tabla1[[#This Row],[Profundidad]]>Tabla1[[#This Row],[Profundidad de trabajo ]],\"Conforme\",\"No conforme\")","v":"Conforme"},{"$f":"Tabla1[[#This Row],[Densidad ]]*Tabla1[[#This Row],[Producción por ciclo ]]","v":{"v":31758.9887604,"d":"31758.99"}},{"v":0.1,"d":"0.10"},{"$f":"Tabla1[[#This Row],[Peso ]]+Tabla1[[#This Row],[Peso de material]]","v":{"v":80542.9887604,"d":"80542.99"}},{"$f":"(Tabla1[[#This Row],[Factor de tracción ]]*Tabla1[[#This Row],[Carga total]])/1000","v":{"v":56.38009213227999,"d":"56.38"}},1.09,1.41,{"$f":"Tabla1[[#This Row],[dmin]]/(Tabla1[[#This Row],[Velod. Avance]]*1000/60)","v":{"v":1.1009174311926604,"d":"1.10"}},{"$f":"Tabla1[[#This Row],[dmin]]/(Tabla1[[#This Row],[Velod. Retroceso]]*1000/60)","v":{"v":0.851063829787234,"d":"0.85"}},{"$f":"Tabla1[[#This Row],[Power shift]]+Tabla1[[#This Row],[T. Avance]]+Tabla1[[#This Row],[T. Retroceso]]","v":{"v":2.0519812609798946,"d":"2.05"}},0.69,{"$f":"(Tabla1[[#This Row],[Producción por ciclo ]]*60*Tabla1[[#This Row],[Eficiencia]])/Tabla1[[#This Row],[Cm]]","v":{"v":385.9984211248412,"d":"386.00"}}]
["D9R",{"v":48784,"d":"48784.00"},"Universal ",{"v":6.96,"d":"6.960"},{"v":4.65,"d":"4.650"},1.934,0.606,"Arena seca ",{"v":1420,"d":"1420.00"},"Empuje facil",{"$f":"IF(Tabla1[[#This Row],[Nivel de empuje]]=\"Empuje facil\",1.1,IF(Tabla1[[#This Row],[Nivel de empuje]]=\"Empuje promedio\",0.9,IF(Tabla1[[#This Row],[Nivel de empuje]]=\"Empuje medio dificultoso\",0.7,IF(Tabla1[[#This Row],[Nivel de empuje]]=\"Empuje dificultoso\",0.6,\" \"))))","v":{"v":1.1,"d":"1.10"}},0.39,{"$f":"Tabla1[[#This Row],[Ancho ]]*(Tabla1[[#This Row],[Altura ]]^2)*Tabla1[[#This Row],[Factor Hoja]]","v":{"v":19.13192094,"d":"19.132"}},{"$f":"Tabla1[[#This Row],[Producción por ciclo ]]/(Tabla1[[#This Row],[Profundidad]]*Tabla1[[#This Row],[Ancho ]])","v":{"v":6.7894250825082505,"d":"6.79"}},{"$f":"MROUND(3*Tabla1[[#This Row],[Longitud ]],10)","v":{"v":20,"d":"20.00"}},{"$f":"Tabla1[[#This Row],[Producción por ciclo ]]/(Tabla1[[#This Row],[dmin]]*Tabla1[[#This Row],[Ancho ]])","v":{"v":0.20571958,"d":"0.2057"}},{"$f":"IF(Tabla1[[#This Row],[Profundidad]]>Tabla1[[#This Row],[Profundidad de trabajo ]],\"Conforme\",\"No conforme\")","v":"Conforme"},{"$f":"Tabla1[[#This Row],[Densidad ]]*Tabla1[[#This Row],[Producción por ciclo ]]","v":{"v":27167.3277348,"d":"27167.33"}},{"v":0.1,"d":"0.10"},{"$f":"Tabla1[[#This Row],[Peso ]]+Tabla1[[#This Row],[Peso de material]]","v":{"v":75951.3277348,"d":"75951.33"}},{"$f":"(Tabla1[[#This Row],[Factor de tracción ]]*Tabla1[[#This Row],[Carga total]])/1000","v":{"v":29.621017816572,"d":"29.62"}},2.61,1.41,{"$f":"Tabla1[[#This Row],[dmin]]/(Tabla1[[#This Row],[Velod. Avance]]*1000/60)","v":{"v":0.45977011494252873,"d":"0.46"}},{"$f":"Tabla1[[#This Row],[dmin]]/(Tabla1[[#This Row],[Velod. Retroceso]]*1000/60)","v":{"v":0.851063829787234,"d":"0.85"}},{"$f":"Tabla1[[#This Row],[Power shift]]+Tabla1[[#This Row],[T. Avance]]+Tabla1[[#This Row],[T. Retroceso]]","v":{"v":1.4108339447297626,"d":"1.41"}},0.69,{"$f":"(Tabla1[[#This Row],[Producción por ciclo ]]*60*Tabla1[[#This Row],[Eficiencia]])/Tabla1[[#This Row],[Cm]]","v":{"v":561.413715536675,"d":"561.41"}}]
["D9R",{"v":48784,"d":"48784.00"},"Universal ",{"v":6.96,"d":"6.960"},{"v":4.65,"d":"4.650"},1.934,0.606,"Arena húmeda ",{"v":1690,"d":"1690.00"},"Empuje medio dificultoso",{"$f":"IF(Tabla1[[#This Row],[Nivel de empuje]]=\"Empuje facil\",1.1,IF(Tabla1[[#This Row],[Nivel de empuje]]=\"Empuje promedio\",0.9,IF(Tabla1[[#This Row],[Nivel de empuje]]=\"Empuje medio dificultoso\",0.7,IF(Tabla1[[#This Row],[Nivel de empuje]]=\"Empuje dificultoso\",0.6,\" \"))))","v":{"v":0.7,"d":"0.70"}},{"v":0.5,"d":"0.50"},{"$f":"Tabla1[[#This Row],[Ancho ]]*(Tabla1[[#This Row],[Altura ]]^2)*Tabla1[[#This Row],[Factor Hoja]]","v":{"v":12.17485878,"d":"12.175"}},{"$f":"Tabla1[[#This Row],[Producción por ciclo ]]/(Tabla1[[#This Row],[Profundidad]]*Tabla1[[#This Row],[Ancho ]])","v":{"v":4.320543234323432,"d":"4.32"}},{"$f":"MROUND(3*Tabla1[[#This Row],[Longitud ]],10)","v":{"v":20,"d":"20.00"}},{"$f":"Tabla1[[#This Row],[Producción por ciclo ]]/(Tabla1[[#This Row],[dmin]]*Tabla1[[#This Row],[Ancho ]])","v":{"v":0.13091245999999998,"d":"0.1309"}},{"$f":"IF(Tabla1[[#This Row],[Profundidad]]>Tabla1[[#This Row],[Profundidad de trabajo ]],\"Conforme\",\"No conforme\")","v":"Conforme"},{"$f":"Tabla1[[#This Row],[Densidad ]]*Tabla1[[#This Row],[Producción por ciclo ]]","v":{"v":20575.511338199998,"d":"20575.51"}},{"v":0.1,"d":"0.10"},{"$f":"Tabla1[[#This Row],[Peso ]]+Tabla1[[#This Row],[Peso de material]]","v":{"v":69359.5113382,"d":"69359.51"}},{"$f":"(Tabla1[[#This Row],[Factor de tracción ]]*Tabla1[[#This Row],[Carga total]])/1000","v":{"v":34.6797556691,"d":"34.68"}},2.28,1.41,{"$f":"Tabla1[[#This Row],[dmin]]/(Tabla1[[#This Row],[Velod. Avance]]*1000/60)","v":{"v":0.5263157894736842,"d":"0.53"}},{"$f":"Tabla1[[#This Row],[dmin]]/(Tabla1[[#This Row],[Velod. Retroceso]]*1000/60)","v":{"v":0.851063829787234,"d":"0.85"}},{"$f":"Tabla1[[#This Row],[Power shift]]+Tabla1[[#This Row],[T. Avance]]+Tabla1[[#This Row],[T. Retroceso]]","v":{"v":1.477379619260918,"d":"1.48"}},0.69,{"$f":"(Tabla1[[#This Row],[Producción por ciclo ]]*60*Tabla1[[#This Row],[Eficiencia]])/Tabla1[[#This Row],[Cm]]","v":{"v":341.1710483349928,"d":"341.17"}}]
["D9R",{"v":48784,"d":"48784.00"},"Universal ",{"v":6.96,"d":"6.960"},{"v":4.65,"d":"4.650"},1.934,0.606,"Grava suelta ",{"v":1930,"d":"1930.00"},"Empuje promedio",{"$f":"IF(Tabla1[[#This Row],[Nivel de empuje]]=\"Empuje facil\",1.1,IF(Tabla1[[#This Row],[Nivel de empuje]]=\"Empuje promedio\",0.9,IF(Tabla1[[#This Row],[Nivel de empuje]]=\"Empuje medio dificultoso\",0.7,IF(Tabla1[[#This Row],[Nivel de empuje]]=\"Empuje dificultoso\",0.6,\" \"))))","v":{"v":0.9,"d":"0.90"}},{"v":0.5,"d":"0.50"},{"$f":"Tabla1[[#This Row],[Ancho ]]*(Tabla1[[#This Row],[Altura ]]^2)*Tabla1[[#This Row],[Factor Hoja]]","v":{"v":15.653389859999999,"d":"15.653"}},{"$f":"Tabla1[[#This Row],[Producción por ciclo ]]/(Tabla1[[#This Row],[Profundidad]]*Tabla1[[#This Row],[Ancho ]])","v":{"v":5.554984158415841,"d":"5.55"}},{"$f":"MROUND(3*Tabla1[[#This Row],[Longitud ]],10)","v":{"v":20,"d":"20.00"}},{"$f":"Tabla1[[#This Row],[Producción por ciclo ]]/(Tabla1[[#This Row],[dmin]]*Tabla1[[#This Row],[Ancho ]])","v":{"v":0.16831601999999998,"d":"0.1683"}},{"$f":"IF(Tabla1[[#This Row],[Profundidad]]>Tabla1[[#This Row],[Profundidad de trabajo ]],\"Conforme\",\"No conforme\")","v":"Conforme"},{"$f":"Tabla1[[#This Row],[Densidad ]]*Tabla1[[#This Row],[Producción por ciclo ]]","v":{"v":30211.0424298,"d":"30211.04"}},{"v":0.1,"d":"0.10"},{"$f":"Tabla1[[#This Row],[Peso ]]+Tabla1[[#This Row],[Peso de material]]","v":{"v":78995.0424298,"d":"78995.04"}},{"$f":"(Tabla1[[#This Row],[Factor de tracción ]]*Tabla1[[#This Row],[Carga total]])/1000","v":{"v":39.4975212149,"d":"39.50"}},{"v":2,"d":"2.00"},1.41,{"$f":"Tabla1[[#This Row],[dmin]]/(Tabla1[[#This Row],[Velod. Avance]]*1000/60)","v":{"v":0.6,"d":"0.60"}},{"$f":"Tabla1[[#This Row],[dmin]]/(Tabla1[[#This Row],[Velod. Retroceso]]*1000/60)","v":{"v":0.851063829787234,"d":"0.85"}},{"$f":"Tabla1[[#This Row],[Power shift]]+Tabla1[[#This Row],[T. Avance]]+Tabla1[[#This Row],[T. Retroceso]]","v":{"v":1.5510638297872341,"d":"1.55"}},0.69,{"$f":"(Tabla1[[#This Row],[Producción por ciclo ]]*60*Tabla1[[#This Row],[Eficiencia]])/Tabla1[[#This Row],[Cm]]","v":{"v":417.81023305333326,"d":"417.81"}}]
["D9R",{"v":48784,"d":"48784.00"},"Universal ",{"v":6.96,"d":"6.960"},{"v":4.65,"d":"4.650"},1.934,0.606,"Nieve compacta",{"v":130,"d":"130.00"},"Empuje medio dificultoso",{"$f":"IF(Tabla1[[#This Row],[Nivel de empuje]]=\"Empuje facil\",1.1,IF(Tabla1[[#This Row],[Nivel de empuje]]=\"Empuje promedio\",0.9,IF(Tabla1[[#This Row],[Nivel de empuje]]=\"Empuje medio dificultoso\",0.7,IF(Tabla1[[#This Row],[Nivel de empuje]]=\"Empuje dificultoso\",0.6,\" \"))))","v":{"v":0.7,"d":"0.70"}},0.27,{"$f":"Tabla1[[#This Row],[Ancho ]]*(Tabla1[[#This Row],[Altura ]]^2)*Tabla1[[#This Row],[Factor Hoja]]","v":{"v":12.17485878,"d":"12.175"}},{"$f":"Tabla1[[#This Row],[Producción por ciclo ]]/(Tabla1[[#This Row],[Profundidad]]*Tabla1[[#This Row],[Ancho ]])","v":{"v":4.320543234323432,"d":"4.32"}},{"$f":"MROUND(3*Tabla1[[#This Row],[Longitud ]],10)","v":{"v":20,"d":"20.00"}},{"$f":"Tabla1[[#This Row],[Producción por ciclo ]]/(Tabla1[[#This Row],[dmin]]*Tabla1[[#This Row],[Ancho ]])","v":{"v":0.13091245999999998,"d":"0.1309"}},{"$f":"IF(Tabla1[[#This Row],[Profundidad]]>Tabla1[[#This Row],[Profundidad de trabajo ]],\"Conforme\",\"No conforme\")","v":"Conforme"},{"$f":"Tabla1[[#This Row],[Densidad ]]*Tabla1[[#This Row],[Producción por ciclo ]]","v":{"v":1582.7316414,"d":"1582.73"}},{"v":0.1,"d":"0.10"},{"$f":"Tabla1[[#This Row],[Peso ]]+Tabla1[[#This Row],[Peso de material]]","v":{"v":50366.7316414,"d":"50366.73"}},{"$f":"(Tabla1[[#This Row],[Factor de tracción ]]*Tabla1[[#This Row],[Carga total]])/1000","v":{"v":13.599017543178,"d":"13.60"}},5.29,1.41,{"$f":"Tabla1[[#This Row],[dmin]]/(Tabla1[[#This Row],[Velod. Avance]]*1000/60)","v":{"v":0.22684310018903592,"d":"0.23"}},{"$f":"Tabla1[[#This Row],[dmin]]/(Tabla1[[#This Row],[Velod. Retroceso]]*1000/60)","v":{"v":0.851063829787234,"d":"0.85"}},{"$f":"Tabla1[[#This Row],[Power shift]]+Tabla1[[#This Row],[T. Avance]]+Tabla1[[#This Row],[T. Retroceso]]","v":{"v":1.17790692997627,"d":"1.18"}},0.69,{"$f":"(Tabla1[[#This Row],[Producción por ciclo ]]*60*Tabla1[[#This Row],[Eficiencia]])/Tabla1[[#This Row],[Cm]]","v":{"v":427.91084818743224,"d":"427.91"}}]
["D9R",{"v":48784,"d":"48784.00"},"Universal ",{"v":6.96,"d":"6.960"},{"v":4.65,"d":"4.650"},1.934,0.606,"Hielo ",{"v":520,"d":"520.00"},"Empuje dificultoso",{"$f":"IF(Tabla1[[#This Row],[Nivel de empuje]]=\"Empuje facil\",1.1,IF(Tabla1[[#This Row],[Nivel de empuje]]=\"Empuje promedio\",0.9,IF(Tabla1[[#This Row],[Nivel de empuje]]=\"Empuje medio dificultoso\",0.7,IF(Tabla1[[#This Row],[Nivel de empuje]]=\"Empuje dificultoso\",0.6,\" \"))))","v":{"v":0.6,"d":"0.60"}},0.12,{"$f":"Tabla1[[#This Row],[Ancho ]]*(Tabla1[[#This Row],[Altura ]]^2)*Tabla1[[#This Row],[Factor Hoja]]","v":{"v":10.43559324,"d":"10.436"}},{"$f":"Tabla1[[#This Row],[Producción por ciclo ]]/(Tabla1[[#This Row],[Profundidad]]*Tabla1[[#This Row],[Ancho ]])","v":{"v":3.703322772277227,"d":"3.70"}},{"$f":"MROUND(3*Tabla1[[#This Row],[Longitud ]],10)","v":{"v":20,"d":"20.00"}},{"$f":"Tabla1[[#This Row],[Producción por ciclo ]]/(Tabla1[[#This Row],[dmin]]*Tabla1[[#This Row],[Ancho ]])","v":{"v":0.11221068,"d":"0.1122"}},{"$f":"IF(Tabla1[[#This Row],[Profundidad]]>Tabla1[[#This Row],[Profundidad de trabajo ]],\"Conforme\",\"No conforme\")","v":"Conforme"},{"$f":"Tabla1[[#This Row],[Densidad ]]*Tabla1[[#This Row],[Producción por ciclo ]]","v":{"v":5426.5084848,"d":"5426.51"}},{"v":0.1,"d":"0.10"},{"$f":"Tabla1[[#This Row],[Peso ]]+Tabla1[[#This Row],[Peso de material]]","v":{"v":54210.5084848,"d":"54210.51"}},{"$f":"(Tabla1[[#This Row],[Factor de tracción ]]*Tabla1[[#This Row],[Carga total]])/1000","v":{"v":6.505261018175999,"d":"6.51"}},10.21,1.41,{"$f":"Tabla1[[#This Row],[dmin]]/(Tabla1[[#This Row],[Velod. Avance]]*1000/60)","v":{"v":0.11753183153770813,"d":"0.12"}},{"$f":"Tabla1[[#This Row],[dmin]]/(Tabla1[[#This Row],[Velod. Retroceso]]*1000/60)","v":{"v":0.851063829787234,"d":"0.85"}},{"$f":"Tabla1[[#This Row],[Power shift]]+Tabla1[[#This Row],[T. Avance]]+Tabla1[[#This Row],[T. Retroceso]]","v":{"v":1.068595661324942,"d":"1.07"}},0.69,{"$f":"(Tabla1[[#This Row],[Producción por ciclo ]]*60*Tabla1[[#This Row],[Eficiencia]])/Tabla1[[#This Row],[Cm]]","v":{"v":404.3003128052433,"d":"404.30"}}]
["D9R",{"v":48784,"d":"48784.00"},"Universal ",{"v":6.96,"d":"6.960"},{"v":4.65,"d":"4.650"},1.934,0.606,"Tierra firme ",{"v":1510,"d":"1510.00"},"Empuje facil",{"$f":"IF(Tabla1[[#This Row],[Nivel de empuje]]=\"Empuje facil\",1.1,IF(Tabla1[[#This Row],[Nivel de empuje]]=\"Empuje promedio\",0.9,IF(Tabla1[[#This Row],[Nivel de empuje]]=\"Empuje medio dificultoso\",0.7,IF(Tabla1[[#This Row],[Nivel de empuje]]=\"Empuje dificultoso\",0.6,\" \"))))","v":{"v":1.1,"d":"1.10"}},{"v":0.9,"d":"0.90"},{"$f":"Tabla1[[#This Row],[Ancho ]]*(Tabla1[[#This Row],[Altura ]]^2)*Tabla1[[#This Row],[Factor Hoja]]","v":{"v":19.13192094,"d":"19.132"}},{"$f":"Tabla1[[#This Row],[Producción por ciclo ]]/(Tabla1[[#This Row],[Profundidad]]*Tabla1[[#This Row],[Ancho ]])","v":{"v":6.7894250825082505,"d":"6.79"}},{"$f":"MROUND(3*Tabla1[[#This Row],[Longitud ]],10)","v":{"v":20,"d":"20.00"}},{"$f":"Tabla1[[#This Row],[Producción por ciclo ]]/(Tabla1[[#This Row],[dmin]]*Tabla1[[#This Row],[Ancho ]])","v":{"v":0.20571958,"d":"0.2057"}},{"$f":"IF(Tabla1[[#This Row],[Profundidad]]>Tabla1[[#This Row],[Profundidad de trabajo ]],\"Conforme\",\"No conforme\")","v":"Conforme"},{"$f":"Tabla1[[#This Row],[Densidad ]]*Tabla1[[#This Row],[Producción por ciclo ]]","v":{"v":28889.200619400002,"d":"28889.20"}},{"v":0.1,"d":"0.10"},{"$f":"Tabla1[[#This Row],[Peso ]]+Tabla1[[#This Row],[Peso de material]]","v":{"v":77673.2006194,"d":"77673.20"}},{"$f":"(Tabla1[[#This Row],[Factor de tracción ]]*Tabla1[[#This Row],[Carga total]])/1000","v":{"v":69.90588055746,"d":"69.91"}},0.33,1.41,{"$f":"Tabla1[[#This Row],[dmin]]/(Tabla1[[#This Row],[Velod. Avance]]*1000/60)","v":{"v":3.6363636363636362,"d":"3.64"}},{"$f":"Tabla1[[#This Row],[dmin]]/(Tabla1[[#This Row],[Velod. Retroceso]]*1000/60)","v":{"v":0.851063829787234,"d":"0.85"}},{"$f":"Tabla1[[#This Row],[Power shift]]+Tabla1[[#This Row],[T. Avance]]+Tabla1[[#This Row],[T. Retroceso]]","v":{"v":4.587427466150871,"d":"4.59"}},0.69,{"$f":"(Tabla1[[#This Row],[Producción por ciclo ]]*60*Tabla1[[#This Row],[Eficiencia]])/Tabla1[[#This Row],[Cm]]","v":{"v":172.6591935807952,"d":"172.66"}}]
["D9R",{"v":48784,"d":"48784.00"},"Universal ",{"v":6.96,"d":"6.960"},{"v":4.65,"d":"4.650"},1.934,0.606,"Tierra suelta ",{"v":1250,"d":"1250.00"},"Empuje facil",{"$f":"IF(Tabla1[[#This Row],[Nivel de empuje]]=\"Empuje facil\",1.1,IF(Tabla1[[#This Row],[Nivel de empuje]]=\"Empuje promedio\",0.9,IF(Tabla1[[#This Row],[Nivel de empuje]]=\"Empuje medio dificultoso\",0.7,IF(Tabla1[[#This Row],[Nivel de empuje]]=\"Empuje dificultoso\",0.6,\" \"))))","v":{"v":1.1,"d":"1.10"}},{"v":0.6,"d":"0.60"},{"$f":"Tabla1[[#This Row],[Ancho ]]*(Tabla1[[#This Row],[Altura ]]^2)*Tabla1[[#This Row],[Factor Hoja]]","v":{"v":19.13192094,"d":"19.132"}},{"$f":"Tabla1[[#This Row],[Producción por ciclo ]]/(Tabla1[[#This Row],[Profundidad]]*Tabla1[[#This Row],[Ancho ]])","v":{"v":6.7894250825082505,"d":"6.79"}},{"$f":"MROUND(3*Tabla1[[#This Row],[Longitud ]],10)","v":{"v":20,"d":"20.00"}},{"$f":"Tabla1[[#This Row],[Producción por ciclo ]]/(Tabla1[[#This Row],[dmin]]*Tabla1[[#This Row],[Ancho ]])","v":{"v":0.20571958,"d":"0.2057"}},{"$f":"IF(Tabla1[[#This Row],[Profundidad]]>Tabla1[[#This Row],[Profundidad de trabajo ]],\"Conforme\",\"No conforme\")","v":"Conforme"},{"$f":"Tabla1[[#This Row],[Densidad ]]*Tabla1[[#This Row],[Producción por ciclo ]]","v":{"v":23914.901175,"d":"23914.90"}},{"v":0.1,"d":"0.10"},{"$f":"Tabla1[[#This Row],[Peso ]]+Tabla1[[#This Row],[Peso de material]]","v":{"v":72698.901175,"d":"72698.90"}},{"$f":"(Tabla1[[#This Row],[Factor de tracción ]]*Tabla1[[#This Row],[Carga total]])/1000","v":{"v":43.619340705,"d":"43.62"}},1.79,1.41,{"$f":"Tabla1[[#This Row],[dmin]]/(Tabla1[[#This Row],[Velod. Avance]]*1000/60)","v":{"v":0.670391061452514,"d":"0.67"}},{"$f":"Tabla1[[#This Row],[dmin]]/(Tabla1[[#This Row],[Velod. Retroceso]]*1000/60)","v":{"v":0.851063829787234,"d":"0.85"}},{"$f":"Tabla1[[#This Row],[Power shift]]+Tabla1[[#This Row],[T. Avance]]+Tabla1[[#This Row],[T. Retroceso]]","v":{"v":1.6214548912397482,"d":"1.62"}},0.69,{"$f":"(Tabla1[[#This Row],[Producción por ciclo ]]*60*Tabla1[[#This Row],[Eficiencia]])/Tabla1[[#This Row],[Cm]]","v":{"v":488.4881665196358,"d":"488.49"}}]
["D9R",{"v":48784,"d":"48784.00"},"Universal ",{"v":6.96,"d":"6.960"},{"v":4.65,"d":"4.650"},1.934,0.606,"Carbón ",{"v":1190,"d":"1190.00"},"Empuje promedio",{"$f":"IF(Tabla1[[#This Row],[Nivel de empuje]]=\"Empuje facil\",1.1,IF(Tabla1[[#This Row],[Nivel de empuje]]=\"Empuje promedio\",0.9,IF(Tabla1[[#This Row],[Nivel de empuje]]=\"Empuje medio dificultoso\",0.7,IF(Tabla1[[#This Row],[Nivel de empuje]]=\"Empuje dificultoso\",0.6,\" \"))))","v":{"v":0.9,"d":"0.90"}},{"v":0.6,"d":"0.60"},{"$f":"Tabla1[[#This Row],[Ancho ]]*(Tabla1[[#This Row],[Altura ]]^2)*Tabla1[[#This Row],[Factor Hoja]]","v":{"v":15.653389859999999,"d":"15.653"}},{"$f":"Tabla1[[#This Row],[Producción por ciclo ]]/(Tabla1[[#This Row],[Profundidad]]*Tabla1[[#This Row],[Ancho ]])","v":{"v":5.554984158415841,"d":"5.55"}},{"$f":"MROUND(3*Tabla1[[#This Row],[Longitud ]],10)","v":{"v":20,"d":"20.00"}},{"$f":"Tabla1[[#This Row],[Producción por ciclo ]]/(Tabla1[[#This Row],[dmin]]*Tabla1[[#This Row],[Ancho ]])","v":{"v":0.16831601999999998,"d":"0.1683"}},{"$f":"IF(Tabla1[[#This Row],[Profundidad]]>Tabla1[[#This Row],[Profundidad de trabajo ]],\"Conforme\",\"No conforme\")","v":"Conforme"},{"$f":"Tabla1[[#This Row],[Densidad ]]*Tabla1[[#This Row],[Producción por ciclo ]]","v":{"v":18627.5339334,"d":"18627.53"}},{"v":0.1,"d":"0.10"},{"$f":"Tabla1[[#This Row],[Peso ]]+Tabla1[[#This Row],[Peso de material]]","v":{"v":67411.5339334,"d":"67411.53"}},{"$f":"(Tabla1[[#This Row],[Factor de tracción ]]*Tabla1[[#This Row],[Carga total]])/1000","v":{"v":40.44692036004,"d":"40.45"}},1.96,1.41,{"$f":"Tabla1[[#This Row],[dmin]]/(Tabla1[[#This Row],[Velod. Avance]]*1000/60)","v":{"v":0.6122448979591837,"d":"0.61"}},{"$f":"Tabla1[[#This Row],[dmin]]/(Tabla1[[#This Row],[Velod. Retroceso]]*1000/60)","v":{"v":0.851063829787234,"d":"0.85"}},{"$f":"Tabla1[[#This Row],[Power shift]]+Tabla1[[#This Row],[T. Avance]]+Tabla1[[#This Row],[T. Retroceso]]","v":{"v":1.5633087277464177,"d":"1.56"}},0.69,{"$f":"(Tabla1[[#This Row],[Producción por ciclo ]]*60*Tabla1[[#This Row],[Eficiencia]])/Tabla1[[#This Row],[Cm]]","v":{"v":414.5376589422581,"d":"414.54"}}]
["D9T",{"v":47872,"d":"47872.00"},"Semi universal",{"v":6.6,"d":"6.600"},{"v":4.31,"d":"4.310"},1.934,0.606,"Concreto ",{"v":2400,"d":"2400.00"},"Empuje dificultoso",{"$f":"IF(Tabla1[[#This Row],[Nivel de empuje]]=\"Empuje facil\",1.1,IF(Tabla1[[#This Row],[Nivel de empuje]]=\"Empuje promedio\",0.9,IF(Tabla1[[#This Row],[Nivel de empuje]]=\"Empuje medio dificultoso\",0.7,IF(Tabla1[[#This Row],[Nivel de empuje]]=\"Empuje dificultoso\",0.6,\" \"))))","v":{"v":0.6,"d":"0.60"}},0.45,{"$f":"Tabla1[[#This Row],[Ancho ]]*(Tabla1[[#This Row],[Altura ]]^2)*Tabla1[[#This Row],[Factor Hoja]]","v":{"v":9.672560615999997,"d":"9.673"}},{"$f":"Tabla1[[#This Row],[Producción por ciclo ]]/(Tabla1[[#This Row],[Profundidad]]*Tabla1[[#This Row],[Ancho ]])","v":{"v":3.703322772277227,"d":"3.70"}},{"$f":"MROUND(3*Tabla1[[#This Row],[Longitud ]],10)","v":{"v":20,"d":"20.00"}},{"$f":"Tabla1[[#This Row],[Producción por ciclo ]]/(Tabla1[[#This Row],[dmin]]*Tabla1[[#This Row],[Ancho ]])","v":{"v":0.11221067999999998,"d":"0.1122"}},{"$f":"IF(Tabla1[[#This Row],[Profundidad]]>Tabla1[[#This Row],[Profundidad de trabajo ]],\"Conforme\",\"No conforme\")","v":"Conforme"},{"$f":"Tabla1[[#This Row],[Densidad ]]*Tabla1[[#This Row],[Producción por ciclo ]]","v":{"v":23214.14547839999,"d":"23214.15"}},{"v":0.1,"d":"0.10"},{"$f":"Tabla1[[#This Row],[Peso ]]+Tabla1[[#This Row],[Peso de material]]","v":{"v":71086.1454784,"d":"71086.15"}},{"$f":"(Tabla1[[#This Row],[Factor de tracción ]]*Tabla1[[#This Row],[Carga total]])/1000","v":{"v":31.988765465279997,"d":"31.99"}},{"v":2.6,"d":"2.60"},1.54,{"$f":"Tabla1[[#This Row],[dmin]]/(Tabla1[[#This Row],[Velod. Avance]]*1000/60)","v":{"v":0.4615384615384615,"d":"0.46"}},{"$f":"Tabla1[[#This Row],[dmin]]/(Tabla1[[#This Row],[Velod. Retroceso]]*1000/60)","v":{"v":0.7792207792207791,"d":"0.78"}},{"$f":"Tabla1[[#This Row],[Power shift]]+Tabla1[[#This Row],[T. Avance]]+Tabla1[[#This Row],[T. Retroceso]]","v":{"v":1.3407592407592408,"d":"1.34"}},0.69,{"$f":"(Tabla1[[#This Row],[Producción por ciclo ]]*60*Tabla1[[#This Row],[Eficiencia]])/Tabla1[[#This Row],[Cm]]","v":{"v":298.66958759548635,"d":"298.67"}}]
["D9T",{"v":47872,"d":"47872.00"},"Semi universal",{"v":6.6,"d":"6.600"},{"v":4.31,"d":"4.310"},1.934,0.606,"Arcilla seca ",{"v":1480,"d":"1480.00"},"Empuje medio dificultoso",{"$f":"IF(Tabla1[[#This Row],[Nivel de empuje]]=\"Empuje facil\",1.1,IF(Tabla1[[#This Row],[Nivel de empuje]]=\"Empuje promedio\",0.9,IF(Tabla1[[#This Row],[Nivel de empuje]]=\"Empuje medio dificultoso\",0.7,IF(Tabla1[[#This Row],[Nivel de empuje]]=\"Empuje dificultoso\",0.6,\" \"))))","v":{"v":0.7,"d":"0.70"}},{"v":0.9,"d":"0.90"},{"$f":"Tabla1[[#This Row],[Ancho ]]*(Tabla1[[#This Row],[Altura ]]^2)*Tabla1[[#This Row],[Factor Hoja]]","v":{"v":11.284654051999997,"d":"11.285"}},{"$f":"Tabla1[[#This Row],[Producción por ciclo ]]/(Tabla1[[#This Row],[Profundidad]]*Tabla1[[#This Row],[Ancho ]])","v":{"v":4.320543234323432,"d":"4.32"}},{"$f":"MROUND(3*Tabla1[[#This Row],[Longitud ]],10)","v":{"v":20,"d":"20.00"}},{"$f":"Tabla1[[#This Row],[Producción por ciclo ]]/(Tabla1[[#This Row],[dmin]]*Tabla1[[#This Row],[Ancho ]])","v":{"v":0.13091245999999998,"d":"0.1309"}},{"$f":"IF(Tabla1[[#This Row],[Profundidad]]>Tabla1[[#This Row],[Profundidad de trabajo ]],\"Conforme\",\"No conforme\")","v":"Conforme"},{"$f":"Tabla1[[#This Row],[Densidad ]]*Tabla1[[#This Row],[Producción por ciclo ]]","v":{"v":16701.287996959996,"d":"16701.29"}},{"v":0.1,"d":"0.10"},{"$f":"Tabla1[[#This Row],[Peso ]]+Tabla1[[#This Row],[Peso de material]]","v":{"v":64573.287996959996,"d":"64573.29"}},{"$f":"(Tabla1[[#This Row],[Factor de tracción ]]*Tabla1[[#This Row],[Carga total]])/1000","v":{"v":58.115959197264,"d":"58.12"}},1.03,1.54,{"$f":"Tabla1[[#This Row],[dmin]]/(Tabla1[[#This Row],[Velod. Avance]]*1000/60)","v":{"v":1.1650485436893203,"d":"1.17"}},{"$f":"Tabla1[[#This Row],[dmin]]/(Tabla1[[#This Row],[Velod. Retroceso]]*1000/60)","v":{"v":0.7792207792207791,"d":"0.78"}},{"$f":"Tabla1[[#This Row],[Power shift]]+Tabla1[[#This Row],[T. Avance]]+Tabla1[[#This Row],[T. Retroceso]]","v":{"v":2.0442693229100994,"d":"2.04"}},0.69,{"$f":"(Tabla1[[#This Row],[Producción por ciclo ]]*60*Tabla1[[#This Row],[Eficiencia]])/Tabla1[[#This Row],[Cm]]","v":{"v":228.53382013664603,"d":"228.53"}}]
["D9T",{"v":47872,"d":"47872.00"},"Semi universal",{"v":6.6,"d":"6.600"},{"v":4.31,"d":"4.310"},1.934,0.606,"Arcilla húmeda",{"v":1660,"d":"1660.00"},"Empuje facil",{"$f":"IF(Tabla1[[#This Row],[Nivel de empuje]]=\"Empuje facil\",1.1,IF(Tabla1[[#This Row],[Nivel de empuje]]=\"Empuje promedio\",0.9,IF(Tabla1[[#This Row],[Nivel de empuje]]=\"Empuje medio dificultoso\",0.7,IF(Tabla1[[#This Row],[Nivel de empuje]]=\"Empuje dificultoso\",0.6,\" \"))))","v":{"v":1.1,"d":"1.10"}},{"v":0.7,"d":"0.70"},{"$f":"Tabla1[[#This Row],[Ancho ]]*(Tabla1[[#This Row],[Altura ]]^2)*Tabla1[[#This Row],[Factor Hoja]]","v":{"v":17.733027796,"d":"17.733"}},{"$f":"Tabla1[[#This Row],[Producción por ciclo ]]/(Tabla1[[#This Row],[Profundidad]]*Tabla1[[#This Row],[Ancho ]])","v":{"v":6.789425082508251,"d":"6.79"}},{"$f":"MROUND(3*Tabla1[[#This Row],[Longitud ]],10)","v":{"v":20,"d":"20.00"}},{"$f":"Tabla1[[#This Row],[Producción por ciclo ]]/(Tabla1[[#This Row],[dmin]]*Tabla1[[#This Row],[Ancho ]])","v":{"v":0.20571958,"d":"0.2057"}},{"$f":"IF(Tabla1[[#This Row],[Profundidad]]>Tabla1[[#This Row],[Profundidad de trabajo ]],\"Conforme\",\"No conforme\")","v":"Conforme"},{"$f":"Tabla1[[#This Row],[Densidad ]]*Tabla1[[#This Row],[Producción por ciclo ]]","v":{"v":29436.826141359998,"d":"29436.83"}},{"v":0.1,"d":"0.10"},{"$f":"Tabla1[[#This Row],[Peso ]]+Tabla1[[#This Row],[Peso de material]]","v":{"v":77308.82614136,"d":"77308.83"}},{"$f":"(Tabla1[[#This Row],[Factor de tracción ]]*Tabla1[[#This Row],[Carga total]])/1000","v":{"v":54.11617829895199,"d":"54.12"}},1.31,1.54,{"$f":"Tabla1[[#This Row],[dmin]]/(Tabla1[[#This Row],[Velod. Avance]]*1000/60)","v":{"v":0.9160305343511451,"d":"0.92"}},{"$f":"Tabla1[[#This Row],[dmin]]/(Tabla1[[#This Row],[Velod. Retroceso]]*1000/60)","v":{"v":0.7792207792207791,"d":"0.78"}},{"$f":"Tabla1[[#This Row],[Power shift]]+Tabla1[[#This Row],[T. Avance]]+Tabla1[[#This Row],[T. Retroceso]]","v":{"v":1.7952513135719244,"d":"1.80"}},0.69,{"$f":"(Tabla1[[#This Row],[Producción por ciclo ]]*60*Tabla1[[#This Row],[Eficiencia]])/Tabla1[[#This Row],[Cm]]","v":{"v":408.9384841020963,"d":"408.94"}}]
["D9T",{"v":47872,"d":"47872.00"},"Semi universal",{"v":6.6,"d":"6.600"},{"v":4.31,"d":"4.310"},1.934,0.606,"Arena seca ",{"v":1420,"d":"1420.00"},"Empuje facil",{"$f":"IF(Tabla1[[#This Row],[Nivel de empuje]]=\"Empuje facil\",1.1,IF(Tabla1[[#This Row],[Nivel de empuje]]=\"Empuje promedio\",0.9,IF(Tabla1[[#This Row],[Nivel de empuje]]=\"Empuje medio dificultoso\",0.7,IF(Tabla1[[#This Row],[Nivel de empuje]]=\"Empuje dificultoso\",0.6,\" \"))))","v":{"v":1.1,"d":"1.10"}},0.39,{"$f":"Tabla1[[#This Row],[Ancho ]]*(Tabla1[[#This Row],[Altura ]]^2)*Tabla1[[#This Row],[Factor Hoja]]","v":{"v":17.733027796,"d":"17.733"}},{"$f":"Tabla1[[#This Row],[Producción por ciclo ]]/(Tabla1[[#This Row],[Profundidad]]*Tabla1[[#This Row],[Ancho ]])","v":{"v":6.789425082508251,"d":"6.79"}},{"$f":"MROUND(3*Tabla1[[#This Row],[Longitud ]],10)","v":{"v":20,"d":"20.00"}},{"$f":"Tabla1[[#This Row],[Producción por ciclo ]]/(Tabla1[[#This Row],[dmin]]*Tabla1[[#This Row],[Ancho ]])","v":{"v":0.20571958,"d":"0.2057"}},{"$f":"IF(Tabla1[[#This Row],[Profundidad]]>Tabla1[[#This Row],[Profundidad de trabajo ]],\"Conforme\",\"No conforme\")","v":"Conforme"},{"$f":"Tabla1[[#This Row],[Densidad ]]*Tabla1[[#This Row],[Producción por ciclo ]]","v":{"v":25180.899470319997,"d":"25180.90"}},{"v":0.1,"d":"0.10"},{"$f":"Tabla1[[#This Row],[Peso ]]+Tabla1[[#This Row],[Peso de material]]","v":{"v":73052.89947032,"d":"73052.90"}},{"$f":"(Tabla1[[#This Row],[Factor de tracción ]]*Tabla1[[#This Row],[Carga total]])/1000","v":{"v":28.4906307934248,"d":"28.49"}},{"v":2.8,"d":"2.80"},1.54,{"$f":"Tabla1[[#This Row],[dmin]]/(Tabla1[[#This Row],[Velod. Avance]]*1000/60)","v":{"v":0.4285714285714286,"d":"0.43"}},{"$f":"Tabla1[[#This Row],[dmin]]/(Tabla1[[#This Row],[Velod. Retroceso]]*1000/60)","v":{"v":0.7792207792207791,"d":"0.78"}},{"$f":"Tabla1[[#This Row],[Power shift]]+Tabla1[[#This Row],[T. Avance]]+Tabla1[[#This Row],[T. Retroceso]]","v":{"v":1.3077922077922077,"d":"1.31"}},0.69,{"$f":"(Tabla1[[#This Row],[Producción por ciclo ]]*60*Tabla1[[#This Row],[Eficiencia]])/Tabla1[[#This Row],[Cm]]","v":{"v":561.3639126920436,"d":"561.36"}}]
["D9T",{"v":47872,"d":"47872.00"},"Semi universal",{"v":6.6,"d":"6.600"},{"v":4.31,"d":"4.310"},1.934,0.606,"Arena húmeda ",{"v":1690,"d":"1690.00"},"Empuje medio dificultoso",{"$f":"IF(Tabla1[[#This Row],[Nivel de empuje]]=\"Empuje facil\",1.1,IF(Tabla1[[#This Row],[Nivel de empuje]]=\"Empuje promedio\",0.9,IF(Tabla1[[#This Row],[Nivel de empuje]]=\"Empuje medio dificultoso\",0.7,IF(Tabla1[[#This Row],[Nivel de empuje]]=\"Empuje dificultoso\",0.6,\" \"))))","v":{"v":0.7,"d":"0.70"}},{"v":0.5,"d":"0.50"},{"$f":"Tabla1[[#This Row],[Ancho ]]*(Tabla1[[#This Row],[Altura ]]^2)*Tabla1[[#This Row],[Factor Hoja]]","v":{"v":11.284654051999997,"d":"11.285"}},{"$f":"Tabla1[[#This Row],[Producción por ciclo ]]/(Tabla1[[#This Row],[Profundidad]]*Tabla1[[#This Row],[Ancho ]])","v":{"v":4.320543234323432,"d":"4.32"}},{"$f":"MROUND(3*Tabla1[[#This Row],[Longitud ]],10)","v":{"v":20,"d":"20.00"}},{"$f":"Tabla1[[#This Row],[Producción por ciclo ]]/(Tabla1[[#This Row],[dmin]]*Tabla1[[#This Row],[Ancho ]])","v":{"v":0.13091245999999998,"d":"0.1309"}},{"$f":"IF(Tabla1[[#This Row],[Profundidad]]>Tabla1[[#This Row],[Profundidad de trabajo ]],\"Conforme\",\"No conforme\")","v":"Conforme"},{"$f":"Tabla1[[#This Row],[Densidad ]]*Tabla1[[#This Row],[Producción por ciclo ]]","v":{"v":19071.065347879994,"d":"19071.07"}},{"v":0.1,"d":"0.10"},{"$f":"Tabla1[[#This Row],[Peso ]]+Tabla1[[#This Row],[Peso de material]]","v":{"v":66943.06534788,"d":"66943.07"}},{"$f":"(Tabla1[[#This Row],[Factor de tracción ]]*Tabla1[[#This Row],[Carga total]])/1000","v":{"v":33.47153267394,"d":"33.47"}},2.55,1.54,{"$f":"Tabla1[[#This Row],[dmin]]/(Tabla1[[#This Row],[Velod. Avance]]*1000/60)","v":{"v":0.47058823529411764,"d":"0.47"}},{"$f":"Tabla1[[#This Row],[dmin]]/(Tabla1[[#This Row],[Velod. Retroceso]]*1000/60)","v":{"v":0.7792207792207791,"d":"0.78"}},{"$f":"Tabla1[[#This Row],[Power shift]]+Tabla1[[#This Row],[T. Avance]]+Tabla1[[#This Row],[T. Retroceso]]","v":{"v":1.3498090145148969,"d":"1.35"}},0.69,{"$f":"(Tabla1[[#This Row],[Producción por ciclo ]]*60*Tabla1[[#This Row],[Eficiencia]])/Tabla1[[#This Row],[Cm]]","v":{"v":346.11168893452657,"d":"346.11"}}]
["D9T",{"v":47872,"d":"47872.00"},"Semi universal",{"v":6.6,"d":"6.600"},{"v":4.31,"d":"4.310"},1.934,0.606,"Grava suelta ",{"v":1930,"d":"1930.00"},"Empuje promedio",{"$f":"IF(Tabla1[[#This Row],[Nivel de empuje]]=\"Empuje facil\",1.1,IF(Tabla1[[#This Row],[Nivel de empuje]]=\"Empuje promedio\",0.9,IF(Tabla1[[#This Row],[Nivel de empuje]]=\"Empuje medio dificultoso\",0.7,IF(Tabla1[[#This Row],[Nivel de empuje]]=\"Empuje dificultoso\",0.6,\" \"))))","v":{"v":0.9,"d":"0.90"}},{"v":0.5,"d":"0.50"},{"$f":"Tabla1[[#This Row],[Ancho ]]*(Tabla1[[#This Row],[Altura ]]^2)*Tabla1[[#This Row],[Factor Hoja]]","v":{"v":14.508840923999998,"d":"14.509"}},{"$f":"Tabla1[[#This Row],[Producción por ciclo ]]/(Tabla1[[#This Row],[Profundidad]]*Tabla1[[#This Row],[Ancho ]])","v":{"v":5.5549841584158415,"d":"5.55"}},{"$f":"MROUND(3*Tabla1[[#This Row],[Longitud ]],10)","v":{"v":20,"d":"20.00"}},{"$f":"Tabla1[[#This Row],[Producción por ciclo ]]/(Tabla1[[#This Row],[dmin]]*Tabla1[[#This Row],[Ancho ]])","v":{"v":0.16831601999999998,"d":"0.1683"}},{"$f":"IF(Tabla1[[#This Row],[Profundidad]]>Tabla1[[#This Row],[Profundidad de trabajo ]],\"Conforme\",\"No conforme\")","v":"Conforme"},{"$f":"Tabla1[[#This Row],[Densidad ]]*Tabla1[[#This Row],[Producción por ciclo ]]","v":{"v":28002.062983319996,"d":"28002.06"}},{"v":0.1,"d":"0.10"},{"$f":"Tabla1[[#This Row],[Peso ]]+Tabla1[[#This Row],[Peso de material]]","v":{"v":75874.06298332,"d":"75874.06"}},{"$f":"(Tabla1[[#This Row],[Factor de tracción ]]*Tabla1[[#This Row],[Carga total]])/1000","v":{"v":37.937031491659994,"d":"37.94"}},2.22,1.54,{"$f":"Tabla1[[#This Row],[dmin]]/(Tabla1[[#This Row],[Velod. Avance]]*1000/60)","v":{"v":0.5405405405405406,"d":"0.54"}},{"$f":"Tabla1[[#This Row],[dmin]]/(Tabla1[[#This Row],[Velod. Retroceso]]*1000/60)","v":{"v":0.7792207792207791,"d":"0.78"}},{"$f":"Tabla1[[#This Row],[Power shift]]+Tabla1[[#This Row],[T. Avance]]+Tabla1[[#This Row],[T. Retroceso]]","v":{"v":1.4197613197613197,"d":"1.42"}},0.69,{"$f":"(Tabla1[[#This Row],[Producción por ciclo ]]*60*Tabla1[[#This Row],[Eficiencia]])/Tabla1[[#This Row],[Cm]]","v":{"v":423.0753478722604,"d":"423.08"}}]
["D9T",{"v":47872,"d":"47872.00"},"Semi universal",{"v":6.6,"d":"6.600"},{"v":4.31,"d":"4.310"},1.934,0.606,"Nieve compacta",{"v":130,"d":"130.00"},"Empuje medio dificultoso",{"$f":"IF(Tabla1[[#This Row],[Nivel de empuje]]=\"Empuje facil\",1.1,IF(Tabla1[[#This Row],[Nivel de empuje]]=\"Empuje promedio\",0.9,IF(Tabla1[[#This Row],[Nivel de empuje]]=\"Empuje medio dificultoso\",0.7,IF(Tabla1[[#This Row],[Nivel de empuje]]=\"Empuje dificultoso\",0.6,\" \"))))","v":{"v":0.7,"d":"0.70"}},0.27,{"$f":"Tabla1[[#This Row],[Ancho ]]*(Tabla1[[#This Row],[Altura ]]^2)*Tabla1[[#This Row],[Factor Hoja]]","v":{"v":11.284654051999997,"d":"11.285"}},{"$f":"Tabla1[[#This Row],[Producción por ciclo ]]/(Tabla1[[#This Row],[Profundidad]]*Tabla1[[#This Row],[Ancho ]])","v":{"v":4.320543234323432,"d":"4.32"}},{"$f":"MROUND(3*Tabla1[[#This Row],[Longitud ]],10)","v":{"v":20,"d":"20.00"}},{"$f":"Tabla1[[#This Row],[Producción por ciclo ]]/(Tabla1[[#This Row],[dmin]]*Tabla1[[#This Row],[Ancho ]])","v":{"v":0.13091245999999998,"d":"0.1309"}},{"$f":"IF(Tabla1[[#This Row],[Profundidad]]>Tabla1[[#This Row],[Profundidad de trabajo ]],\"Conforme\",\"No conforme\")","v":"Conforme"},{"$f":"Tabla1[[#This Row],[Densidad ]]*Tabla1[[#This Row],[Producción por ciclo ]]","v":{"v":1467.0050267599995,"d":"1467.01"}},{"v":0.1,"d":"0.10"},{"$f":"Tabla1[[#This Row],[Peso ]]+Tabla1[[#This Row],[Peso de material]]","v":{"v":49339.00502676,"d":"49339.01"}},{"$f":"(Tabla1[[#This Row],[Factor de tracción ]]*Tabla1[[#This Row],[Carga total]])/1000","v":{"v":13.3215313572252,"d":"13.32"}},5.99,1.54,{"$f":"Tabla1[[#This Row],[dmin]]/(Tabla1[[#This Row],[Velod. Avance]]*1000/60)","v":{"v":0.2003338898163606,"d":"0.20"}},{"$f":"Tabla1[[#This Row],[dmin]]/(Tabla1[[#This Row],[Velod. Retroceso]]*1000/60)","v":{"v":0.7792207792207791,"d":"0.78"}},{"$f":"Tabla1[[#This Row],[Power shift]]+Tabla1[[#This Row],[T. Avance]]+Tabla1[[#This Row],[T. Retroceso]]","v":{"v":1.0795546690371398,"d":"1.08"}},0.69,{"$f":"(Tabla1[[#This Row],[Producción por ciclo ]]*60*Tabla1[[#This Row],[Eficiencia]])/Tabla1[[#This Row],[Cm]]","v":{"v":432.75684979389155,"d":"432.76"}}]
["D9T",{"v":47872,"d":"47872.00"},"Semi universal",{"v":6.6,"d":"6.600"},{"v":4.31,"d":"4.310"},1.934,0.606,"Hielo ",{"v":520,"d":"520.00"},"Empuje dificultoso",{"$f":"IF(Tabla1[[#This Row],[Nivel de empuje]]=\"Empuje facil\",1.1,IF(Tabla1[[#This Row],[Nivel de empuje]]=\"Empuje promedio\",0.9,IF(Tabla1[[#This Row],[Nivel de empuje]]=\"Empuje medio dificultoso\",0.7,IF(Tabla1[[#This Row],[Nivel de empuje]]=\"Empuje dificultoso\",0.6,\" \"))))","v":{"v":0.6,"d":"0.60"}},0.12,{"$f":"Tabla1[[#This Row],[Ancho ]]*(Tabla1[[#This Row],[Altura ]]^2)*Tabla1[[#This Row],[Factor Hoja]]","v":{"v":9.672560615999997,"d":"9.673"}},{"$f":"Tabla1[[#This Row],[Producción por ciclo ]]/(Tabla1[[#This Row],[Profundidad]]*Tabla1[[#This Row],[Ancho ]])","v":{"v":3.703322772277227,"d":"3.70"}},{"$f":"MROUND(3*Tabla1[[#This Row],[Longitud ]],10)","v":{"v":20,"d":"20.00"}},{"$f":"Tabla1[[#This Row],[Producción por ciclo ]]/(Tabla1[[#This Row],[dmin]]*Tabla1[[#This Row],[Ancho ]])","v":{"v":0.11221067999999998,"d":"0.1122"}},{"$f":"IF(Tabla1[[#This Row],[Profundidad]]>Tabla1[[#This Row],[Profundidad de trabajo ]],\"Conforme\",\"No conforme\")","v":"Conforme"},{"$f":"Tabla1[[#This Row],[Densidad ]]*Tabla1[[#This Row],[Producción por ciclo ]]","v":{"v":5029.731520319998,"d":"5029.73"}},{"v":0.1,"d":"0.10"},{"$f":"Tabla1[[#This Row],[Peso ]]+Tabla1[[#This Row],[Peso de material]]","v":{"v":52901.73152032,"d":"52901.73"}},{"$f":"(Tabla1[[#This Row],[Factor de tracción ]]*Tabla1[[#This Row],[Carga total]])/1000","v":{"v":6.3482077824384,"d":"6.35"}},9.89,1.54,{"$f":"Tabla1[[#This Row],[dmin]]/(Tabla1[[#This Row],[Velod. Avance]]*1000/60)","v":{"v":0.12133468149646107,"d":"0.12"}},{"$f":"Tabla1[[#This Row],[dmin]]/(Tabla1[[#This Row],[Velod. Retroceso]]*1000/60)","v":{"v":0.7792207792207791,"d":"0.78"}},{"$f":"Tabla1[[#This Row],[Power shift]]+Tabla1[[#This Row],[T. Avance]]+Tabla1[[#This Row],[T. Retroceso]]","v":{"v":1.0005554607172402,"d":"1.00"}},0.69,{"$f":"(Tabla1[[#This Row],[Producción por ciclo ]]*60*Tabla1[[#This Row],[Eficiencia]])/Tabla1[[#This Row],[Cm]]","v":{"v":400.2217020687136,"d":"400.22"}}]
["D9T",{"v":47872,"d":"47872.00"},"Semi universal",{"v":6.6,"d":"6.600"},{"v":4.31,"d":"4.310"},1.934,0.606,"Tierra firme ",{"v":1510,"d":"1510.00"},"Empuje facil",{"$f":"IF(Tabla1[[#This Row],[Nivel de empuje]]=\"Empuje facil\",1.1,IF(Tabla1[[#This Row],[Nivel de empuje]]=\"Empuje promedio\",0.9,IF(Tabla1[[#This Row],[Nivel de empuje]]=\"Empuje medio dificultoso\",0.7,IF(Tabla1[[#This Row],[Nivel de empuje]]=\"Empuje dificultoso\",0.6,\" \"))))","v":{"v":1.1,"d":"1.10"}},{"v":0.9,"d":"0.90"},{"$f":"Tabla1[[#This Row],[Ancho ]]*(Tabla1[[#This Row],[Altura ]]^2)*Tabla1[[#This Row],[Factor Hoja]]","v":{"v":17.733027796,"d":"17.733"}},{"$f":"Tabla1[[#This Row],[Producción por ciclo ]]/(Tabla1[[#This Row],[Profundidad]]*Tabla1[[#This Row],[Ancho ]])","v":{"v":6.789425082508251,"d":"6.79"}},{"$f":"MROUND(3*Tabla1[[#This Row],[Longitud ]],10)","v":{"v":20,"d":"20.00"}},{"$f":"Tabla1[[#This Row],[Producción por ciclo ]]/(Tabla1[[#This Row],[dmin]]*Tabla1[[#This Row],[Ancho ]])","v":{"v":0.20571958,"d":"0.2057"}},{"$f":"IF(Tabla1[[#This Row],[Profundidad]]>Tabla1[[#This Row],[Profundidad de trabajo ]],\"Conforme\",\"No conforme\")","v":"Conforme"},{"$f":"Tabla1[[#This Row],[Densidad ]]*Tabla1[[#This Row],[Producción por ciclo ]]","v":{"v":26776.871971959998,"d":"26776.87"}},{"v":0.1,"d":"0.10"},{"$f":"Tabla1[[#This Row],[Peso ]]+Tabla1[[#This Row],[Peso de material]]","v":{"v":74648.87197196,"d":"74648.87"}},{"$f":"(Tabla1[[#This Row],[Factor de tracción ]]*Tabla1[[#This Row],[Carga total]])/1000","v":{"v":67.183984774764,"d":"67.18"}},{"v":0.6,"d":"0.60"},1.54,{"$f":"Tabla1[[#This Row],[dmin]]/(Tabla1[[#This Row],[Velod. Avance]]*1000/60)","v":{"v":2,"d":"2.00"}},{"$f":"Tabla1[[#This Row],[dmin]]/(Tabla1[[#This Row],[Velod. Retroceso]]*1000/60)","v":{"v":0.7792207792207791,"d":"0.78"}},{"$f":"Tabla1[[#This Row],[Power shift]]+Tabla1[[#This Row],[T. Avance]]+Tabla1[[#This Row],[T. Retroceso]]","v":{"v":2.879220779220779,"d":"2.88"}},0.69,{"$f":"(Tabla1[[#This Row],[Producción por ciclo ]]*60*Tabla1[[#This Row],[Eficiencia]])/Tabla1[[#This Row],[Cm]]","v":{"v":254.98126300446006,"d":"254.98"}}]
["D9T",{"v":47872,"d":"47872.00"},"Semi universal",{"v":6.6,"d":"6.600"},{"v":4.31,"d":"4.310"},1.934,0.606,"Tierra suelta ",{"v":1250,"d":"1250.00"},"Empuje facil",{"$f":"IF(Tabla1[[#This Row],[Nivel de empuje]]=\"Empuje facil\",1.1,IF(Tabla1[[#This Row],[Nivel de empuje]]=\"Empuje promedio\",0.9,IF(Tabla1[[#This Row],[Nivel de empuje]]=\"Empuje medio dificultoso\",0.7,IF(Tabla1[[#This Row],[Nivel de empuje]]=\"Empuje dificultoso\",0.6,\" \"))))","v":{"v":1.1,"d":"1.10"}},{"v":0.6,"d":"0.60"},{"$f":"Tabla1[[#This Row],[Ancho ]]*(Tabla1[[#This Row],[Altura ]]^2)*Tabla1[[#This Row],[Factor Hoja]]","v":{"v":17.733027796,"d":"17.733"}},{"$f":"Tabla1[[#This Row],[Producción por ciclo ]]/(Tabla1[[#This Row],[Profundidad]]*Tabla1[[#This Row],[Ancho ]])","v":{"v":6.789425082508251,"d":"6.79"}},{"$f":"MROUND(3*Tabla1[[#This Row],[Longitud ]],10)","v":{"v":20,"d":"20.00"}},{"$f":"Tabla1[[#This Row],[Producción por ciclo ]]/(Tabla1[[#This Row],[dmin]]*Tabla1[[#This Row],[Ancho ]])","v":{"v":0.20571958,"d":"0.2057"}},{"$f":"IF(Tabla1[[#This Row],[Profundidad]]>Tabla1[[#This Row],[Profundidad de trabajo ]],\"Conforme\",\"No conforme\")","v":"Conforme"},{"$f":"Tabla1[[#This Row],[Densidad ]]*Tabla1[[#This Row],[Producción por ciclo ]]","v":{"v":22166.284744999997,"d":"22166.28"}},{"v":0.1,"d":"0.10"},{"$f":"Tabla1[[#This Row],[Peso ]]+Tabla1[[#This Row],[Peso de material]]","v":{"v":70038.284745,"d":"70038.28"}},{"$f":"(Tabla1[[#This Row],[Factor de tracción ]]*Tabla1[[#This Row],[Carga total]])/1000","v":{"v":42.022970846999996,"d":"42.02"}},1.99,1.54,{"$f":"Tabla1[[#This Row],[dmin]]/(Tabla1[[#This Row],[Velod. Avance]]*1000/60)","v":{"v":0.6030150753768845,"d":"0.60"}},{"$f":"Tabla1[[#This Row],[dmin]]/(Tabla1[[#This Row],[Velod. Retroceso]]*1000/60)","v":{"v":0.7792207792207791,"d":"0.78"}},{"$f":"Tabla1[[#This Row],[Power shift]]+Tabla1[[#This Row],[T. Avance]]+Tabla1[[#This Row],[T. Retroceso]]","v":{"v":1.4822358545976635,"d":"1.48"}},0.69,{"$f":"(Tabla1[[#This Row],[Producción por ciclo ]]*60*Tabla1[[#This Row],[Eficiencia]])/Tabla1[[#This Row],[Cm]]","v":{"v":495.2972554787349,"d":"495.30"}}]
["D9T",{"v":47872,"d":"47872.00"},"Semi universal",{"v":6.6,"d":"6.600"},{"v":4.31,"d":"4.310"},1.934,0.606,"Carbón ",{"v":1190,"d":"1190.00"},"Empuje promedio",{"$f":"IF(Tabla1[[#This Row],[Nivel de empuje]]=\"Empuje facil\",1.1,IF(Tabla1[[#This Row],[Nivel de empuje]]=\"Empuje promedio\",0.9,IF(Tabla1[[#This Row],[Nivel de empuje]]=\"Empuje medio dificultoso\",0.7,IF(Tabla1[[#This Row],[Nivel de empuje]]=\"Empuje dificultoso\",0.6,\" \"))))","v":{"v":0.9,"d":"0.90"}},{"v":0.6,"d":"0.60"},{"$f":"Tabla1[[#This Row],[Ancho ]]*(Tabla1[[#This Row],[Altura ]]^2)*Tabla1[[#This Row],[Factor Hoja]]","v":{"v":14.508840923999998,"d":"14.509"}},{"$f":"Tabla1[[#This Row],[Producción por ciclo ]]/(Tabla1[[#This Row],[Profundidad]]*Tabla1[[#This Row],[Ancho ]])","v":{"v":5.5549841584158415,"d":"5.55"}},{"$f":"MROUND(3*Tabla1[[#This Row],[Longitud ]],10)","v":{"v":20,"d":"20.00"}},{"$f":"Tabla1[[#This Row],[Producción por ciclo ]]/(Tabla1[[#This Row],[dmin]]*Tabla1[[#This Row],[Ancho ]])","v":{"v":0.16831601999999998,"d":"0.1683"}},{"$f":"IF(Tabla1[[#This Row],[Profundidad]]>Tabla1[[#This Row],[Profundidad de trabajo ]],\"Conforme\",\"No conforme\")","v":"Conforme"},{"$f":"Tabla1[[#This Row],[Densidad ]]*Tabla1[[#This Row],[Producción por ciclo ]]","v":{"v":17265.52069956,"d":"17265.52"}},{"v":0.1,"d":"0.10"},{"$f":"Tabla1[[#This Row],[Peso ]]+Tabla1[[#This Row],[Peso de material]]","v":{"v":65137.52069956,"d":"65137.52"}},{"$f":"(Tabla1[[#This Row],[Factor de tracción ]]*Tabla1[[#This Row],[Carga total]])/1000","v":{"v":39.082512419736,"d":"39.08"}},2.15,1.54,{"$f":"Tabla1[[#This Row],[dmin]]/(Tabla1[[#This Row],[Velod. Avance]]*1000/60)","v":{"v":0.5581395348837209,"d":"0.56"}},{"$f":"Tabla1[[#This Row],[dmin]]/(Tabla1[[#This Row],[Velod. Retroceso]]*1000/60)","v":{"v":0.7792207792207791,"d":"0.78"}},{"$f":"Tabla1[[#This Row],[Power shift]]+Tabla1[[#This Row],[T. Avance]]+Tabla1[[#This Row],[T. Retroceso]]","v":{"v":1.4373603141045002,"d":"1.44"}},0.69,{"$f":"(Tabla1[[#This Row],[Producción por ciclo ]]*60*Tabla1[[#This Row],[Eficiencia]])/Tabla1[[#This Row],[Cm]]","v":{"v":417.8952266591728,"d":"417.90"}}]
["D9T",{"v":47872,"d":"47872.00"},"Universal ",{"v":6.96,"d":"6.960"},{"v":4.65,"d":"4.650"},1.934,0.606,"Concreto ",{"v":2400,"d":"2400.00"},"Empuje dificultoso",{"$f":"IF(Tabla1[[#This Row],[Nivel de empuje]]=\"Empuje facil\",1.1,IF(Tabla1[[#This Row],[Nivel de empuje]]=\"Empuje promedio\",0.9,IF(Tabla1[[#This Row],[Nivel de empuje]]=\"Empuje medio dificultoso\",0.7,IF(Tabla1[[#This Row],[Nivel de empuje]]=\"Empuje dificultoso\",0.6,\" \"))))","v":{"v":0.6,"d":"0.60"}},0.45,{"$f":"Tabla1[[#This Row],[Ancho ]]*(Tabla1[[#This Row],[Altura ]]^2)*Tabla1[[#This Row],[Factor Hoja]]","v":{"v":10.43559324,"d":"10.436"}},{"$f":"Tabla1[[#This Row],[Producción por ciclo ]]/(Tabla1[[#This Row],[Profundidad]]*Tabla1[[#This Row],[Ancho ]])","v":{"v":3.703322772277227,"d":"3.70"}},{"$f":"MROUND(3*Tabla1[[#This Row],[Longitud ]],10)","v":{"v":20,"d":"20.00"}},{"$f":"Tabla1[[#This Row],[Producción por ciclo ]]/(Tabla1[[#This Row],[dmin]]*Tabla1[[#This Row],[Ancho ]])","v":{"v":0.11221068,"d":"0.1122"}},{"$f":"IF(Tabla1[[#This Row],[Profundidad]]>Tabla1[[#This Row],[Profundidad de trabajo ]],\"Conforme\",\"No conforme\")","v":"Conforme"},{"$f":"Tabla1[[#This Row],[Densidad ]]*Tabla1[[#This Row],[Producción por ciclo ]]","v":{"v":25045.423776,"d":"25045.42"}},{"v":0.1,"d":"0.10"},{"$f":"Tabla1[[#This Row],[Peso ]]+Tabla1[[#This Row],[Peso de material]]","v":{"v":72917.423776,"d":"72917.42"}},{"$f":"(Tabla1[[#This Row],[Factor de tracción ]]*Tabla1[[#This Row],[Carga total]])/1000","v":{"v":32.8128406992,"d":"32.81"}},2.53,1.54,{"$f":"Tabla1[[#This Row],[dmin]]/(Tabla1[[#This Row],[Velod. Avance]]*1000/60)","v":{"v":0.47430830039525695,"d":"0.47"}},{"$f":"Tabla1[[#This Row],[dmin]]/(Tabla1[[#This Row],[Velod. Retroceso]]*1000/60)","v":{"v":0.7792207792207791,"d":"0.78"}},{"$f":"Tabla1[[#This Row],[Power shift]]+Tabla1[[#This Row],[T. Avance]]+Tabla1[[#This Row],[T. Retroceso]]","v":{"v":1.353529079616036,"d":"1.35"}},0.69,{"$f":"(Tabla1[[#This Row],[Producción por ciclo ]]*60*Tabla1[[#This Row],[Eficiencia]])/Tabla1[[#This Row],[Cm]]","v":{"v":319.1904530477894,"d":"319.19"}}]
["D9T",{"v":47872,"d":"47872.00"},"Universal ",{"v":6.96,"d":"6.960"},{"v":4.65,"d":"4.650"},1.934,0.606,"Arcilla seca ",{"v":1480,"d":"1480.00"},"Empuje medio dificultoso",{"$f":"IF(Tabla1[[#This Row],[Nivel de empuje]]=\"Empuje facil\",1.1,IF(Tabla1[[#This Row],[Nivel de empuje]]=\"Empuje promedio\",0.9,IF(Tabla1[[#This Row],[Nivel de empuje]]=\"Empuje medio dificultoso\",0.7,IF(Tabla1[[#This Row],[Nivel de empuje]]=\"Empuje dificultoso\",0.6,\" \"))))","v":{"v":0.7,"d":"0.70"}},{"v":0.9,"d":"0.90"},{"$f":"Tabla1[[#This Row],[Ancho ]]*(Tabla1[[#This Row],[Altura ]]^2)*Tabla1[[#This Row],[Factor Hoja]]","v":{"v":12.17485878,"d":"12.175"}},{"$f":"Tabla1[[#This Row],[Producción por ciclo ]]/(Tabla1[[#This Row],[Profundidad]]*Tabla1[[#This Row],[Ancho ]])","v":{"v":4.320543234323432,"d":"4.32"}},{"$f":"MROUND(3*Tabla1[[#This Row],[Longitud ]],10)","v":{"v":20,"d":"20.00"}},{"$f":"Tabla1[[#This Row],[Producción por ciclo ]]/(Tabla1[[#This Row],[dmin]]*Tabla1[[#This Row],[Ancho ]])","v":{"v":0.13091245999999998,"d":"0.1309"}},{"$f":"IF(Tabla1[[#This Row],[Profundidad]]>Tabla1[[#This Row],[Profundidad de trabajo ]],\"Conforme\",\"No conforme\")","v":"Conforme"},{"$f":"Tabla1[[#This Row],[Densidad ]]*Tabla1[[#This Row],[Producción por ciclo ]]","v":{"v":18018.7909944,"d":"18018.79"}},{"v":0.1,"d":"0.10"},{"$f":"Tabla1[[#This Row],[Peso ]]+Tabla1[[#This Row],[Peso de material]]","v":{"v":65890.7909944,"d":"65890.79"}},{"$f":"(Tabla1[[#This Row],[Factor de tracción ]]*Tabla1[[#This Row],[Carga total]])/1000","v":{"v":59.30171189496,"d":"59.30"}},{"v":1,"d":"1.00"},1.54,{"$f":"Tabla1[[#This Row],[dmin]]/(Tabla1[[#This Row],[Velod. Avance]]*1000/60)","v":{"v":1.2,"d":"1.20"}},{"$f":"Tabla1[[#This Row],[dmin]]/(Tabla1[[#This Row],[Velod. Retroceso]]*1000/60)","v":{"v":0.7792207792207791,"d":"0.78"}},{"$f":"Tabla1[[#This Row],[Power shift]]+Tabla1[[#This Row],[T. Avance]]+Tabla1[[#This Row],[T. Retroceso]]","v":{"v":2.0792207792207793,"d":"2.08"}},0.69,{"$f":"(Tabla1[[#This Row],[Producción por ciclo ]]*60*Tabla1[[#This Row],[Eficiencia]])/Tabla1[[#This Row],[Cm]]","v":{"v":242.41733178565894,"d":"242.42"}}]
["D9T",{"v":47872,"d":"47872.00"},"Universal ",{"v":6.96,"d":"6.960"},{"v":4.65,"d":"4.650"},1.934,0.606,"Arcilla húmeda",{"v":1660,"d":"1660.00"},"Empuje facil",{"$f":"IF(Tabla1[[#This Row],[Nivel de empuje]]=\"Empuje facil\",1.1,IF(Tabla1[[#This Row],[Nivel de empuje]]=\"Empuje promedio\",0.9,IF(Tabla1[[#This Row],[Nivel de empuje]]=\"Empuje medio dificultoso\",0.7,IF(Tabla1[[#This Row],[Nivel de empuje]]=\"Empuje dificultoso\",0.6,\" \"))))","v":{"v":1.1,"d":"1.10"}},{"v":0.7,"d":"0.70"},{"$f":"Tabla1[[#This Row],[Ancho ]]*(Tabla1[[#This Row],[Altura ]]^2)*Tabla1[[#This Row],[Factor Hoja]]","v":{"v":19.13192094,"d":"19.132"}},{"$f":"Tabla1[[#This Row],[Producción por ciclo ]]/(Tabla1[[#This Row],[Profundidad]]*Tabla1[[#This Row],[Ancho ]])","v":{"v":6.7894250825082505,"d":"6.79"}},{"$f":"MROUND(3*Tabla1[[#This Row],[Longitud ]],10)","v":{"v":20,"d":"20.00"}},{"$f":"Tabla1[[#This Row],[Producción por ciclo ]]/(Tabla1[[#This Row],[dmin]]*Tabla1[[#This Row],[Ancho ]])","v":{"v":0.20571958,"d":"0.2057"}},{"$f":"IF(Tabla1[[#This Row],[Profundidad]]>Tabla1[[#This Row],[Profundidad de trabajo ]],\"Conforme\",\"No conforme\")","v":"Conforme"},{"$f":"Tabla1[[#This Row],[Densidad ]]*Tabla1[[#This Row],[Producción por ciclo ]]","v":{"v":31758.9887604,"d":"31758.99"}},{"v":0.1,"d":"0.10"},{"$f":"Tabla1[[#This Row],[Peso ]]+Tabla1[[#This Row],[Peso de material]]","v":{"v":79630.9887604,"d":"79630.99"}},{"$f":"(Tabla1[[#This Row],[Factor de tracción ]]*Tabla1[[#This Row],[Carga total]])/1000","v":{"v":55.741692132279994,"d":"55.74"}},1.21,1.54,{"$f":"Tabla1[[#This Row],[dmin]]/(Tabla1[[#This Row],[Velod. Avance]]*1000/60)","v":{"v":0.9917355371900826,"d":"0.99"}},{"$f":"Tabla1[[#This Row],[dmin]]/(Tabla1[[#This Row],[Velod. Retroceso]]*1000/60)","v":{"v":0.7792207792207791,"d":"0.78"}},{"$f":"Tabla1[[#This Row],[Power shift]]+Tabla1[[#This Row],[T. Avance]]+Tabla1[[#This Row],[T. Retroceso]]","v":{"v":1.8709563164108616,"d":"1.87"}},0.69,{"$f":"(Tabla1[[#This Row],[Producción por ciclo ]]*60*Tabla1[[#This Row],[Eficiencia]])/Tabla1[[#This Row],[Cm]]","v":{"v":423.3458151687084,"d":"423.35"}}]
["D9T",{"v":47872,"d":"47872.00"},"Universal ",{"v":6.96,"d":"6.960"},{"v":4.65,"d":"4.650"},1.934,0.606,"Arena seca ",{"v":1420,"d":"1420.00"},"Empuje facil",{"$f":"IF(Tabla1[[#This Row],[Nivel de empuje]]=\"Empuje facil\",1.1,IF(Tabla1[[#This Row],[Nivel de empuje]]=\"Empuje promedio\",0.9,IF(Tabla1[[#This Row],[Nivel de empuje]]=\"Empuje medio dificultoso\",0.7,IF(Tabla1[[#This Row],[Nivel de empuje]]=\"Empuje dificultoso\",0.6,\" \"))))","v":{"v":1.1,"d":"1.10"}},0.39,{"$f":"Tabla1[[#This Row],[Ancho ]]*(Tabla1[[#This Row],[Altura ]]^2)*Tabla1[[#This Row],[Factor Hoja]]","v":{"v":19.13192094,"d":"19.132"}},{"$f":"Tabla1[[#This Row],[Producción por ciclo ]]/(Tabla1[[#This Row],[Profundidad]]*Tabla1[[#This Row],[Ancho ]])","v":{"v":6.7894250825082505,"d":"6.79"}},{"$f":"MROUND(3*Tabla1[[#This Row],[Longitud ]],10)","v":{"v":20,"d":"20.00"}},{"$f":"Tabla1[[#This Row],[Producción por ciclo ]]/(Tabla1[[#This Row],[dmin]]*Tabla1[[#This Row],[Ancho ]])","v":{"v":0.20571958,"d":"0.2057"}},{"$f":"IF(Tabla1[[#This Row],[Profundidad]]>Tabla1[[#This Row],[Profundidad de trabajo ]],\"Conforme\",\"No conforme\")","v":"Conforme"},{"$f":"Tabla1[[#This Row],[Densidad ]]*Tabla1[[#This Row],[Producción por ciclo ]]","v":{"v":27167.3277348,"d":"27167.33"}},{"v":0.1,"d":"0.10"},{"$f":"Tabla1[[#This Row],[Peso ]]+Tabla1[[#This Row],[Peso de material]]","v":{"v":75039.3277348,"d":"75039.33"}},{"$f":"(Tabla1[[#This Row],[Factor de tracción ]]*Tabla1[[#This Row],[Carga total]])/1000","v":{"v":29.265337816572,"d":"29.27"}},2.79,1.54,{"$f":"Tabla1[[#This Row],[dmin]]/(Tabla1[[#This Row],[Velod. Avance]]*1000/60)","v":{"v":0.43010752688172044,"d":"0.43"}},{"$f":"Tabla1[[#This Row],[dmin]]/(Tabla1[[#This Row],[Velod. Retroceso]]*1000/60)","v":{"v":0.7792207792207791,"d":"0.78"}},{"$f":"Tabla1[[#This Row],[Power shift]]+Tabla1[[#This Row],[T. Avance]]+Tabla1[[#This Row],[T. Retroceso]]","v":{"v":1.3093283061024996,"d":"1.31"}},0.69,{"$f":"(Tabla1[[#This Row],[Producción por ciclo ]]*60*Tabla1[[#This Row],[Eficiencia]])/Tabla1[[#This Row],[Cm]]","v":{"v":604.9372974099547,"d":"604.94"}}]
["D9T",{"v":47872,"d":"47872.00"},"Universal ",{"v":6.96,"d":"6.960"},{"v":4.65,"d":"4.650"},1.934,0.606,"Arena húmeda ",{"v":1690,"d":"1690.00"},"Empuje medio dificultoso",{"$f":"IF(Tabla1[[#This Row],[Nivel de empuje]]=\"Empuje facil\",1.1,IF(Tabla1[[#This Row],[Nivel de empuje]]=\"Empuje promedio\",0.9,IF(Tabla1[[#This Row],[Nivel de empuje]]=\"Empuje medio dificultoso\",0.7,IF(Tabla1[[#This Row],[Nivel de empuje]]=\"Empuje dificultoso\",0.6,\" \"))))","v":{"v":0.7,"d":"0.70"}},{"v":0.5,"d":"0.50"},{"$f":"Tabla1[[#This Row],[Ancho ]]*(Tabla1[[#This Row],[Altura ]]^2)*Tabla1[[#This Row],[Factor Hoja]]","v":{"v":12.17485878,"d":"12.175"}},{"$f":"Tabla1[[#This Row],[Producción por ciclo ]]/(Tabla1[[#This Row],[Profundidad]]*Tabla1[[#This Row],[Ancho ]])","v":{"v":4.320543234323432,"d":"4.32"}},{"$f":"MROUND(3*Tabla1[[#This Row],[Longitud ]],10)","v":{"v":20,"d":"20.00"}},{"$f":"Tabla1[[#This Row],[Producción por ciclo ]]/(Tabla1[[#This Row],[dmin]]*Tabla1[[#This Row],[Ancho ]])","v":{"v":0.13091245999999998,"d":"0.1309"}},{"$f":"IF(Tabla1[[#This Row],[Profundidad]]>Tabla1[[#This Row],[Profundidad de trabajo ]],\"Conforme\",\"No conforme\")","v":"Conforme"},{"$f":"Tabla1[[#This Row],[Densidad ]]*Tabla1[[#This Row],[Producción por ciclo ]]","v":{"v":20575.511338199998,"d":"20575.51"}},{"v":0.1,"d":"0.10"},{"$f":"Tabla1[[#This Row],[Peso ]]+Tabla1[[#This Row],[Peso de material]]","v":{"v":68447.5113382,"d":"68447.51"}},{"$f":"(Tabla1[[#This Row],[Factor de tracción ]]*Tabla1[[#This Row],[Carga total]])/1000","v":{"v":34.2237556691,"d":"34.22"}},2.47,1.54,{"$f":"Tabla1[[#This Row],[dmin]]/(Tabla1[[#This Row],[Velod. Avance]]*1000/60)","v":{"v":0.4858299595141701,"d":"0.49"}},{"$f":"Tabla1[[#This Row],[dmin]]/(Tabla1[[#This Row],[Velod. Retroceso]]*1000/60)","v":{"v":0.7792207792207791,"d":"0.78"}},{"$f":"Tabla1[[#This Row],[Power shift]]+Tabla1[[#This Row],[T. Avance]]+Tabla1[[#This Row],[T. Retroceso]]","v":{"v":1.3650507387349493,"d":"1.37"}},0.69,{"$f":"(Tabla1[[#This Row],[Producción por ciclo ]]*60*Tabla1[[#This Row],[Eficiencia]])/Tabla1[[#This Row],[Cm]]","v":{"v":369.24572778819527,"d":"369.25"}}]
["D9T",{"v":47872,"d":"47872.00"},"Universal ",{"v":6.96,"d":"6.960"},{"v":4.65,"d":"4.650"},1.934,0.606,"Grava suelta ",{"v":1930,"d":"1930.00"},"Empuje promedio",{"$f":"IF(Tabla1[[#This Row],[Nivel de empuje]]=\"Empuje facil\",1.1,IF(Tabla1[[#This Row],[Nivel de empuje]]=\"Empuje promedio\",0.9,IF(Tabla1[[#This Row],[Nivel de empuje]]=\"Empuje medio dificultoso\",0.7,IF(Tabla1[[#This Row],[Nivel de empuje]]=\"Empuje dificultoso\",0.6,\" \"))))","v":{"v":0.9,"d":"0.90"}},{"v":0.5,"d":"0.50"},{"$f":"Tabla1[[#This Row],[Ancho ]]*(Tabla1[[#This Row],[Altura ]]^2)*Tabla1[[#This Row],[Factor Hoja]]","v":{"v":15.653389859999999,"d":"15.653"}},{"$f":"Tabla1[[#This Row],[Producción por ciclo ]]/(Tabla1[[#This Row],[Profundidad]]*Tabla1[[#This Row],[Ancho ]])","v":{"v":5.554984158415841,"d":"5.55"}},{"$f":"MROUND(3*Tabla1[[#This Row],[Longitud ]],10)","v":{"v":20,"d":"20.00"}},{"$f":"Tabla1[[#This Row],[Producción por ciclo ]]/(Tabla1[[#This Row],[dmin]]*Tabla1[[#This Row],[Ancho ]])","v":{"v":0.16831601999999998,"d":"0.1683"}},{"$f":"IF(Tabla1[[#This Row],[Profundidad]]>Tabla1[[#This Row],[Profundidad de trabajo ]],\"Conforme\",\"No conforme\")","v":"Conforme"},{"$f":"Tabla1[[#This Row],[Densidad ]]*Tabla1[[#This Row],[Producción por ciclo ]]","v":{"v":30211.0424298,"d":"30211.04"}},{"v":0.1,"d":"0.10"},{"$f":"Tabla1[[#This Row],[Peso ]]+Tabla1[[#This Row],[Peso de material]]","v":{"v":78083.0424298,"d":"78083.04"}},{"$f":"(Tabla1[[#This Row],[Factor de tracción ]]*Tabla1[[#This Row],[Carga total]])/1000","v":{"v":39.0415212149,"d":"39.04"}},2.15,1.54,{"$f":"Tabla1[[#This Row],[dmin]]/(Tabla1[[#This Row],[Velod. Avance]]*1000/60)","v":{"v":0.5581395348837209,"d":"0.56"}},{"$f":"Tabla1[[#This Row],[dmin]]/(Tabla1[[#This Row],[Velod. Retroceso]]*1000/60)","v":{"v":0.7792207792207791,"d":"0.78"}},{"$f":"Tabla1[[#This Row],[Power shift]]+Tabla1[[#This Row],[T. Avance]]+Tabla1[[#This Row],[T. Retroceso]]","v":{"v":1.4373603141045002,"d":"1.44"}},0.69,{"$f":"(Tabla1[[#This Row],[Producción por ciclo ]]*60*Tabla1[[#This Row],[Eficiencia]])/Tabla1[[#This Row],[Cm]]","v":{"v":450.8614394350704,"d":"450.86"}}]
["D9T",{"v":47872,"d":"47872.00"},"Universal ",{"v":6.96,"d":"6.960"},{"v":4.65,"d":"4.650"},1.934,0.606,"Nieve compacta",{"v":130,"d":"130.00"},"Empuje medio dificultoso",{"$f":"IF(Tabla1[[#This Row],[Nivel de empuje]]=\"Empuje facil\",1.1,IF(Tabla1[[#This Row],[Nivel de empuje]]=\"Empuje promedio\",0.9,IF(Tabla1[[#This Row],[Nivel de empuje]]=\"Empuje medio dificultoso\",0.7,IF(Tabla1[[#This Row],[Nivel de empuje]]=\"Empuje dificultoso\",0.6,\" \"))))","v":{"v":0.7,"d":"0.70"}},0.27,{"$f":"Tabla1[[#This Row],[Ancho ]]*(Tabla1[[#This Row],[Altura ]]^2)*Tabla1[[#This Row],[Factor Hoja]]","v":{"v":12.17485878,"d":"12.175"}},{"$f":"Tabla1[[#This Row],[Producción por ciclo ]]/(Tabla1[[#This Row],[Profundidad]]*Tabla1[[#This Row],[Ancho ]])","v":{"v":4.320543234323432,"d":"4.32"}},{"$f":"MROUND(3*Tabla1[[#This Row],[Longitud ]],10)","v":{"v":20,"d":"20.00"}},{"$f":"Tabla1[[#This Row],[Producción por ciclo ]]/(Tabla1[[#This Row],[dmin]]*Tabla1[[#This Row],[Ancho ]])","v":{"v":0.13091245999999998,"d":"0.1309"}},{"$f":"IF(Tabla1[[#This Row],[Profundidad]]>Tabla1[[#This Row],[Profundidad de trabajo ]],\"Conforme\",\"No conforme\")","v":"Conforme"},{"$f":"Tabla1[[#This Row],[Densidad ]]*Tabla1[[#This Row],[Producción por ciclo ]]","v":{"v":1582.7316414,"d":"1582.73"}},{"v":0.1,"d":"0.10"},{"$f":"Tabla1[[#This Row],[Peso ]]+Tabla1[[#This Row],[Peso de material]]","v":{"v":49454.7316414,"d":"49454.73"}},{"$f":"(Tabla1[[#This Row],[Factor de tracción ]]*Tabla1[[#This Row],[Carga total]])/1000","v":{"v":13.352777543178002,"d":"13.35"}},5.99,1.54,{"$f":"Tabla1[[#This Row],[dmin]]/(Tabla1[[#This Row],[Velod. Avance]]*1000/60)","v":{"v":0.2003338898163606,"d":"0.20"}},{"$f":"Tabla1[[#This Row],[dmin]]/(Tabla1[[#This Row],[Velod. Retroceso]]*1000/60)","v":{"v":0.7792207792207791,"d":"0.78"}},{"$f":"Tabla1[[#This Row],[Power shift]]+Tabla1[[#This Row],[T. Avance]]+Tabla1[[#This Row],[T. Retroceso]]","v":{"v":1.0795546690371398,"d":"1.08"}},0.69,{"$f":"(Tabla1[[#This Row],[Producción por ciclo ]]*60*Tabla1[[#This Row],[Eficiencia]])/Tabla1[[#This Row],[Cm]]","v":{"v":466.8954411929458,"d":"466.90"}}]
["D9T",{"v":47872,"d":"47872.00"},"Universal ",{"v":6.96,"d":"6.960"},{"v":4.65,"d":"4.650"},1.934,0.606,"Hielo ",{"v":520,"d":"520.00"},"Empuje dificultoso",{"$f":"IF(Tabla1[[#This Row],[Nivel de empuje]]=\"Empuje facil\",1.1,IF(Tabla1[[#This Row],[Nivel de empuje]]=\"Empuje promedio\",0.9,IF(Tabla1[[#This Row],[Nivel de empuje]]=\"Empuje medio dificultoso\",0.7,IF(Tabla1[[#This Row],[Nivel de empuje]]=\"Empuje dificultoso\",0.6,\" \"))))","v":{"v":0.6,"d":"0.60"}},0.12,{"$f":"Tabla1[[#This Row],[Ancho ]]*(Tabla1[[#This Row],[Altura ]]^2)*Tabla1[[#This Row],[Factor Hoja]]","v":{"v":10.43559324,"d":"10.436"}},{"$f":"Tabla1[[#This Row],[Producción por ciclo ]]/(Tabla1[[#This Row],[Profundidad]]*Tabla1[[#This Row],[Ancho ]])","v":{"v":3.703322772277227,"d":"3.70"}},{"$f":"MROUND(3*Tabla1[[#This Row],[Longitud ]],10)","v":{"v":20,"d":"20.00"}},{"$f":"Tabla1[[#This Row],[Producción por ciclo ]]/(Tabla1[[#This Row],[dmin]]*Tabla1[[#This Row],[Ancho ]])","v":{"v":0.11221068,"d":"0.1122"}},{"$f":"IF(Tabla1[[#This Row],[Profundidad]]>Tabla1[[#This Row],[Profundidad de trabajo ]],\"Conforme\",\"No conforme\")","v":"Conforme"},{"$f":"Tabla1[[#This Row],[Densidad ]]*Tabla1[[#This Row],[Producción por ciclo ]]","v":{"v":5426.5084848,"d":"5426.51"}},{"v":0.1,"d":"0.10"},{"$f":"Tabla1[[#This Row],[Peso ]]+Tabla1[[#This Row],[Peso de material]]","v":{"v":53298.5084848,"d":"53298.51"}},{"$f":"(Tabla1[[#This Row],[Factor de tracción ]]*Tabla1[[#This Row],[Carga total]])/1000","v":{"v":6.395821018176,"d":"6.40"}},9.89,1.54,{"$f":"Tabla1[[#This Row],[dmin]]/(Tabla1[[#This Row],[Velod. Avance]]*1000/60)","v":{"v":0.12133468149646107,"d":"0.12"}},{"$f":"Tabla1[[#This Row],[dmin]]/(Tabla1[[#This Row],[Velod. Retroceso]]*1000/60)","v":{"v":0.7792207792207791,"d":"0.78"}},{"$f":"Tabla1[[#This Row],[Power shift]]+Tabla1[[#This Row],[T. Avance]]+Tabla1[[#This Row],[T. Retroceso]]","v":{"v":1.0005554607172402,"d":"1.00"}},0.69,{"$f":"(Tabla1[[#This Row],[Producción por ciclo ]]*60*Tabla1[[#This Row],[Eficiencia]])/Tabla1[[#This Row],[Cm]]","v":{"v":431.7937156889835,"d":"431.79"}}]
["D9T",{"v":47872,"d":"47872.00"},"Universal ",{"v":6.96,"d":"6.960"},{"v":4.65,"d":"4.650"},1.934,0.606,"Tierra firme ",{"v":1510,"d":"1510.00"},"Empuje facil",{"$f":"IF(Tabla1[[#This Row],[Nivel de empuje]]=\"Empuje facil\",1.1,IF(Tabla1[[#This Row],[Nivel de empuje]]=\"Empuje promedio\",0.9,IF(Tabla1[[#This Row],[Nivel de empuje]]=\"Empuje medio dificultoso\",0.7,IF(Tabla1[[#This Row],[Nivel de empuje]]=\"Empuje dificultoso\",0.6,\" \"))))","v":{"v":1.1,"d":"1.10"}},{"v":0.9,"d":"0.90"},{"$f":"Tabla1[[#This Row],[Ancho ]]*(Tabla1[[#This Row],[Altura ]]^2)*Tabla1[[#This Row],[Factor Hoja]]","v":{"v":19.13192094,"d":"19.132"}},{"$f":"Tabla1[[#This Row],[Producción por ciclo ]]/(Tabla1[[#This Row],[Profundidad]]*Tabla1[[#This Row],[Ancho ]])","v":{"v":6.7894250825082505,"d":"6.79"}},{"$f":"MROUND(3*Tabla1[[#This Row],[Longitud ]],10)","v":{"v":20,"d":"20.00"}},{"$f":"Tabla1[[#This Row],[Producción por ciclo ]]/(Tabla1[[#This Row],[dmin]]*Tabla1[[#This Row],[Ancho ]])","v":{"v":0.20571958,"d":"0.2057"}},{"$f":"IF(Tabla1[[#This Row],[Profundidad]]>Tabla1[[#This Row],[Profundidad de trabajo ]],\"Conforme\",\"No conforme\")","v":"Conforme"},{"$f":"Tabla1[[#This Row],[Densidad ]]*Tabla1[[#This Row],[Producción por ciclo ]]","v":{"v":28889.200619400002,"d":"28889.20"}},{"v":0.1,"d":"0.10"},{"$f":"Tabla1[[#This Row],[Peso ]]+Tabla1[[#This Row],[Peso de material]]","v":{"v":76761.2006194,"d":"76761.20"}},{"$f":"(Tabla1[[#This Row],[Factor de tracción ]]*Tabla1[[#This Row],[Carga total]])/1000","v":{"v":69.08508055745999,"d":"69.09"}},0.42,1.54,{"$f":"Tabla1[[#This Row],[dmin]]/(Tabla1[[#This Row],[Velod. Avance]]*1000/60)","v":{"v":2.857142857142857,"d":"2.86"}},{"$f":"Tabla1[[#This Row],[dmin]]/(Tabla1[[#This Row],[Velod. Retroceso]]*1000/60)","v":{"v":0.7792207792207791,"d":"0.78"}},{"$f":"Tabla1[[#This Row],[Power shift]]+Tabla1[[#This Row],[T. Avance]]+Tabla1[[#This Row],[T. Retroceso]]","v":{"v":3.7363636363636363,"d":"3.74"}},0.69,{"$f":"(Tabla1[[#This Row],[Producción por ciclo ]]*60*Tabla1[[#This Row],[Eficiencia]])/Tabla1[[#This Row],[Cm]]","v":{"v":211.98726997751825,"d":"211.99"}}]
["D9T",{"v":47872,"d":"47872.00"},"Universal ",{"v":6.96,"d":"6.960"},{"v":4.65,"d":"4.650"},1.934,0.606,"Tierra suelta ",{"v":1250,"d":"1250.00"},"Empuje facil",{"$f":"IF(Tabla1[[#This Row],[Nivel de empuje]]=\"Empuje facil\",1.1,IF(Tabla1[[#This Row],[Nivel de empuje]]=\"Empuje promedio\",0.9,IF(Tabla1[[#This Row],[Nivel de empuje]]=\"Empuje medio dificultoso\",0.7,IF(Tabla1[[#This Row],[Nivel de empuje]]=\"Empuje dificultoso\",0.6,\" \"))))","v":{"v":1.1,"d":"1.10"}},{"v":0.6,"d":"0.60"},{"$f":"Tabla1[[#This Row],[Ancho ]]*(Tabla1[[#This Row],[Altura ]]^2)*Tabla1[[#This Row],[Factor Hoja]]","v":{"v":19.13192094,"d":"19.132"}},{"$f":"Tabla1[[#This Row],[Producción por ciclo ]]/(Tabla1[[#This Row],[Profundidad]]*Tabla1[[#This Row],[Ancho ]])","v":{"v":6.7894250825082505,"d":"6.79"}},{"$f":"MROUND(3*Tabla1[[#This Row],[Longitud ]],10)","v":{"v":20,"d":"20.00"}},{"$f":"Tabla1[[#This Row],[Producción por ciclo ]]/(Tabla1[[#This Row],[dmin]]*Tabla1[[#This Row],[Ancho ]])","v":{"v":0.20571958,"d":"0.2057"}},{"$f":"IF(Tabla1[[#This Row],[Profundidad]]>Tabla1[[#This Row],[Profundidad de trabajo ]],\"Conforme\",\"No conforme\")","v":"Conforme"},{"$f":"Tabla1[[#This Row],[Densidad ]]*Tabla1[[#This Row],[Producción por ciclo ]]","v":{"v":23914.901175,"d":"23914.90"}},{"v":0.1,"d":"0.10"},{"$f":"Tabla1[[#This Row],[Peso ]]+Tabla1[[#This Row],[Peso de material]]","v":{"v":71786.901175,"d":"71786.90"}},{"$f":"(Tabla1[[#This Row],[Factor de tracción ]]*Tabla1[[#This Row],[Carga total]])/1000","v":{"v":43.072140705,"d":"43.07"}},1.91,1.54,{"$f":"Tabla1[[#This Row],[dmin]]/(Tabla1[[#This Row],[Velod. Avance]]*1000/60)","v":{"v":0.6282722513089005,"d":"0.63"}},{"$f":"Tabla1[[#This Row],[dmin]]/(Tabla1[[#This Row],[Velod. Retroceso]]*1000/60)","v":{"v":0.7792207792207791,"d":"0.78"}},{"$f":"Tabla1[[#This Row],[Power shift]]+Tabla1[[#This Row],[T. Avance]]+Tabla1[[#This Row],[T. Retroceso]]","v":{"v":1.5074930305296796,"d":"1.51"}},0.69,{"$f":"(Tabla1[[#This Row],[Producción por ciclo ]]*60*Tabla1[[#This Row],[Eficiencia]])/Tabla1[[#This Row],[Cm]]","v":{"v":525.4163773066982,"d":"525.42"}}]
["D9T",{"v":47872,"d":"47872.00"},"Universal ",{"v":6.96,"d":"6.960"},{"v":4.65,"d":"4.650"},1.934,0.606,"Carbón ",{"v":1190,"d":"1190.00"},"Empuje promedio",{"$f":"IF(Tabla1[[#This Row],[Nivel de empuje]]=\"Empuje facil\",1.1,IF(Tabla1[[#This Row],[Nivel de empuje]]=\"Empuje promedio\",0.9,IF(Tabla1[[#This Row],[Nivel de empuje]]=\"Empuje medio dificultoso\",0.7,IF(Tabla1[[#This Row],[Nivel de empuje]]=\"Empuje dificultoso\",0.6,\" \"))))","v":{"v":0.9,"d":"0.90"}},{"v":0.6,"d":"0.60"},{"$f":"Tabla1[[#This Row],[Ancho ]]*(Tabla1[[#This Row],[Altura ]]^2)*Tabla1[[#This Row],[Factor Hoja]]","v":{"v":15.653389859999999,"d":"15.653"}},{"$f":"Tabla1[[#This Row],[Producción por ciclo ]]/(Tabla1[[#This Row],[Profundidad]]*Tabla1[[#This Row],[Ancho ]])","v":{"v":5.554984158415841,"d":"5.55"}},{"$f":"MROUND(3*Tabla1[[#This Row],[Longitud ]],10)","v":{"v":20,"d":"20.00"}},{"$f":"Tabla1[[#This Row],[Producción por ciclo ]]/(Tabla1[[#This Row],[dmin]]*Tabla1[[#This Row],[Ancho ]])","v":{"v":0.16831601999999998,"d":"0.1683"}},{"$f":"IF(Tabla1[[#This Row],[Profundidad]]>Tabla1[[#This Row],[Profundidad de trabajo ]],\"Conforme\",\"No conforme\")","v":"Conforme"},{"$f":"Tabla1[[#This Row],[Densidad ]]*Tabla1[[#This Row],[Producción por ciclo ]]","v":{"v":18627.5339334,"d":"18627.53"}},{"v":0.1,"d":"0.10"},{"$f":"Tabla1[[#This Row],[Peso ]]+Tabla1[[#This Row],[Peso de material]]","v":{"v":66499.5339334,"d":"66499.53"}},{"$f":"(Tabla1[[#This Row],[Factor de tracción ]]*Tabla1[[#This Row],[Carga total]])/1000","v":{"v":39.89972036004,"d":"39.90"}},2.09,1.54,{"$f":"Tabla1[[#This Row],[dmin]]/(Tabla1[[#This Row],[Velod. Avance]]*1000/60)","v":{"v":0.5741626794258373,"d":"0.57"}},{"$f":"Tabla1[[#This Row],[dmin]]/(Tabla1[[#This Row],[Velod. Retroceso]]*1000/60)","v":{"v":0.7792207792207791,"d":"0.78"}},{"$f":"Tabla1[[#This Row],[Power shift]]+Tabla1[[#This Row],[T. Avance]]+Tabla1[[#This Row],[T. Retroceso]]","v":{"v":1.4533834586466163,"d":"1.45"}},0.69,{"$f":"(Tabla1[[#This Row],[Producción por ciclo ]]*60*Tabla1[[#This Row],[Eficiencia]])/Tabla1[[#This Row],[Cm]]","v":{"v":445.8908186607967,"d":"445.89"}}]

{"sheet":"Support","index":1,"n_rows":5,"n_cols":14,"rows_kept":5}
[]
[null,"Etiquetas de fila","Suma de Longitud ","Suma de Ancho ","Suma de Altura ","Suma de Profundidad","Suma de Producción Horaria","Suma de Producción por ciclo ","Suma de Factor Hoja","Suma de Power shift","Suma de T. Avance","Suma de T. Retroceso","Suma de Cm","Suma de Eficiencia"]
[null,"Semi universal"]
[null,"D9T"]
[null,"Arcilla seca ",{"v":6.6,"d":"6.60"},4.31,{"v":1.934,"d":"1.93"},{"v":0.606,"d":"0.61"},{"v":228.53382013664603,"d":"228.53"},{"v":11.284654051999997,"d":"11.28"},{"v":0.7,"d":"0.70"},{"v":0.1,"d":"0.10"},{"v":1.1650485436893203,"d":"1.17"},{"v":0.7792207792207791,"d":"0.78"},{"v":2.0442693229100994,"d":"2.04"},0.69]

{"sheet":"DashBoard","index":2,"n_rows":0,"n_cols":0,"rows_kept":0}